null
SMILES: CCc1ccc(cc1-c1nc(cc1C(N)=O)-c1ncnc2[nH]ccc12)C(F)(F)F
InChI Key: InChIKey=LFBJOVNMYXCRMB-UHFFFAOYSA-N
Activity Spreadsheet -- Enzyme Inhibition Constant Data from BindingDB
Found 3 hits for monomerid = 174008
Trg + Lig
Ki
nM
ΔG°
kcal/mole
IC50
nM
Kd
nM
EC50/IC50
nM
koff
s-1
kon
M-1s-1
pHTemp
°C
Tyrosine-protein kinase JAK1 [861-1152]
(Homo sapiens (Human))
BDBM174008
(US9688661, 2-[2-Ethyl-5-(trifluoromethyl)phenyl]-5...)
Show SMILES CCc1ccc(cc1-c1nc(cc1C(N)=O)-c1ncnc2[nH]ccc12)C(F)(F)F
Show InChI InChI=1S/C20H15F3N5O/c1-2-10-3-4-11(20(21,22)23)7-13(10)16-14(18(24)29)8-15(28-16)17-12-5-6-25-19(12)27-9-26-17/h3-9H,2H2,1H3,(H2,24,29)(H,25,26,27)
US Patent
n/an/a 19n/an/an/an/an/an/a
NERVIANO MEDICAL SCIENCES S.R.L.
US Patent
Assay Description
Assays were performed with the JAK1 kinase domain (residues 861-1152 of the 1154 amino acid long full-length sequence, accession number P23458 of Uni...
US Patent US9688661 (2017)
BindingDB Entry DOI: 10.7270/Q2K35RTP
Non-receptor tyrosine-protein kinase TYK2 [833-1187]
(Homo sapiens (Human))
BDBM174008
(US9688661, 2-[2-Ethyl-5-(trifluoromethyl)phenyl]-5...)
Show SMILES CCc1ccc(cc1-c1nc(cc1C(N)=O)-c1ncnc2[nH]ccc12)C(F)(F)F
Show InChI InChI=1S/C20H15F3N5O/c1-2-10-3-4-11(20(21,22)23)7-13(10)16-14(18(24)29)8-15(28-16)17-12-5-6-25-19(12)27-9-26-17/h3-9H,2H2,1H3,(H2,24,29)(H,25,26,27)
US Patent
n/an/a 20n/an/an/an/an/an/a
NERVIANO MEDICAL SCIENCES S.R.L.
US Patent
Assay Description
Assays were performed with the TYK2 kinase domain (residues 833-1187 of the 1187 amino acid long full-length sequence, accession number P29597 of Uni...
US Patent US9688661 (2017)
BindingDB Entry DOI: 10.7270/Q2K35RTP
Tyrosine-protein kinase JAK2
(Homo sapiens (Human))
BDBM174008
(US9688661, 2-[2-Ethyl-5-(trifluoromethyl)phenyl]-5...)
Show SMILES CCc1ccc(cc1-c1nc(cc1C(N)=O)-c1ncnc2[nH]ccc12)C(F)(F)F
Show InChI InChI=1S/C20H15F3N5O/c1-2-10-3-4-11(20(21,22)23)7-13(10)16-14(18(24)29)8-15(28-16)17-12-5-6-25-19(12)27-9-26-17/h3-9H,2H2,1H3,(H2,24,29)(H,25,26,27)
Reactome pathway
US Patent
n/an/a 2n/an/an/an/an/an/a
NERVIANO MEDICAL SCIENCES S.R.L.
US Patent
Assay Description
Assays were performed with the commercially available JAK2 kinase domain (Invitrogen, Eugene, Oreg.) that showed a linear kinetic without prephosphor...
US Patent US9688661 (2017)
BindingDB Entry DOI: 10.7270/Q2K35RTP