BDBM17451 5-(4-methylphenyl)-1H-pyrazole::pyrazole analogue, 7
SMILES: Cc1ccc(cc1)-c1cc[nH]n1
InChI Key: InChIKey=VOMXXXBTALQTAK-UHFFFAOYSA-N
Data: 1 Other
PDB links: 3 PDB IDs contain this monomer as substructures. 5 PDB IDs contain inhibitors having a similarity of 90% to this monomer.
Activity Spreadsheet -- Enzyme Inhibition Constant Data from BindingDB
Found 1 hit for monomerid = 17451
Trg + Lig
Ki
nM
ΔG°
kcal/mole
IC50
nM
Kd
nM
EC50/IC50
nM
koff
s-1
kon
M-1s-1
pHTemp
°C
Methionine aminopeptidase 2
(Homo sapiens (Human))
BDBM17451
(5-(4-methylphenyl)-1H-pyrazole | pyrazole analogue...)
Show SMILES Cc1ccc(cc1)-c1cc[nH]n1
Show InChI InChI=1S/C10H10N2/c1-8-2-4-9(5-3-8)10-6-7-11-12-10/h2-7H,1H3,(H,11,12)
Reactome pathway
n/an/an/an/an/an/an/a7.522
GSK
Assay Description
MetAP2 activity was monitored by measuring the initial velocity of turnover of the artificial substrate Met-AMC. Assays were performed in 96-well mi...
J Med Chem 48: 5644-7 (2005)
Article DOI: 10.1021/jm050408c
BindingDB Entry DOI: 10.7270/Q26M3537