BDBM17455 1,2,3-triazole analogue, 11::5-(4-ethylphenyl)-1H-1,2,3-triazole
SMILES: CCc1ccc(cc1)-c1c[nH]nn1
InChI Key: InChIKey=CTPJEZVMISPIBV-UHFFFAOYSA-N
Data: 1 KI
Activity Spreadsheet -- Enzyme Inhibition Constant Data from BindingDB
Found 1 hit for monomerid = 17455
Trg + Lig
Ki
nM
ΔG°
kcal/mole
IC50
nM
Kd
nM
EC50/IC50
nM
koff
s-1
kon
M-1s-1
pHTemp
°C
Methionine aminopeptidase 2
(Homo sapiens (Human))
BDBM17455
(1,2,3-triazole analogue, 11 | 5-(4-ethylphenyl)-1H...)
Show SMILES CCc1ccc(cc1)-c1c[nH]nn1
Show InChI InChI=1S/C10H11N3/c1-2-8-3-5-9(6-4-8)10-7-11-13-12-10/h3-7H,2H2,1H3,(H,11,12,13)
Reactome pathway
30 -10.2n/an/an/an/an/a7.522
GSK
Assay Description
MetAP2 activity was monitored by measuring the initial velocity of turnover of the artificial substrate Met-AMC. Assays were performed in 96-well mi...
J Med Chem 48: 5644-7 (2005)
Article DOI: 10.1021/jm050408c
BindingDB Entry DOI: 10.7270/Q26M3537