BDBM17478 2-benzenesulfonamido-5,6,7,8-tetrahydronaphthalene-1-carboxylic acid::A751277::Anthranilic Acid Sulfonamide, 5::sulfonamide compound, 11
SMILES: OC(=O)c1c(NS(=O)(=O)c2ccccc2)ccc2CCCCc12
InChI Key: InChIKey=RRXVUYHFDBLTEL-UHFFFAOYSA-N
Data: 3 IC50
PDB links: 1 PDB ID matches this monomer. 1 PDB ID contains this monomer as substructures. 1 PDB ID contains inhibitors having a similarity of 90% to this monomer.
Activity Spreadsheet -- Enzyme Inhibition Constant Data from BindingDB
Found 3 hits for monomerid = 17478
Trg + Lig
Ki
nM
ΔG°
kcal/mole
IC50
nM
Kd
nM
EC50/IC50
nM
koff
s-1
kon
M-1s-1
pHTemp
°C
Methionine aminopeptidase 2
(Homo sapiens (Human))
BDBM17478
(2-benzenesulfonamido-5,6,7,8-tetrahydronaphthalene...)
Show SMILES OC(=O)c1c(NS(=O)(=O)c2ccccc2)ccc2CCCCc12
Show InChI InChI=1S/C17H17NO4S/c19-17(20)16-14-9-5-4-6-12(14)10-11-15(16)18-23(21,22)13-7-2-1-3-8-13/h1-3,7-8,10-11,18H,4-6,9H2,(H,19,20)
Reactome pathway
n/an/a 10n/an/an/an/a7.422
Abbott Laboratories
Assay Description
A coupled enzyme chromogenic assay was developed to measure methionine aminopeptidase-2 activity by monitoring the production of free methionine with...
J Med Chem 49: 3832-49 (2006)
Article DOI: 10.1021/jm0601001
BindingDB Entry DOI: 10.7270/Q22V2DDZ
3D
3D Structure (crystal)
Methionine aminopeptidase 2
(Homo sapiens (Human))
BDBM17478
(2-benzenesulfonamido-5,6,7,8-tetrahydronaphthalene...)
Show SMILES OC(=O)c1c(NS(=O)(=O)c2ccccc2)ccc2CCCCc12
Show InChI InChI=1S/C17H17NO4S/c19-17(20)16-14-9-5-4-6-12(14)10-11-15(16)18-23(21,22)13-7-2-1-3-8-13/h1-3,7-8,10-11,18H,4-6,9H2,(H,19,20)
Reactome pathway
n/an/a 10n/an/an/an/an/an/a
Kermanshah University of Medical Sciences
Curated by ChEMBL
Assay Description
Inhibition of methionine aminopeptidase 2
Eur J Med Chem 45: 4499-508 (2010)
Article DOI: 10.1016/j.ejmech.2010.07.010
BindingDB Entry DOI: 10.7270/Q2KK9D1K
3D
3D Structure (crystal)
Methionine aminopeptidase 2
(Homo sapiens (Human))
BDBM17478
(2-benzenesulfonamido-5,6,7,8-tetrahydronaphthalene...)
Show SMILES OC(=O)c1c(NS(=O)(=O)c2ccccc2)ccc2CCCCc12
Show InChI InChI=1S/C17H17NO4S/c19-17(20)16-14-9-5-4-6-12(14)10-11-15(16)18-23(21,22)13-7-2-1-3-8-13/h1-3,7-8,10-11,18H,4-6,9H2,(H,19,20)
Reactome pathway
n/an/a 9n/an/an/an/a7.422
Abbott Laboratories
Assay Description
A coupled enzyme chromogenic assay was developed to measure methionine aminopeptidase-2 activity by monitoring the production of free methionine with...
Bioorg Med Chem Lett 16: 3574-7 (2006)
Article DOI: 10.1016/j.bmcl.2006.03.085
BindingDB Entry DOI: 10.7270/Q2TB1556
3D
3D Structure (crystal)