BDBM175351 3',4',5'-three-Hydroxyl Benzofuranone (3',4',5'-(OH)3)::6-Hydroxy-2-(3',4',5'-trihydroxybenzylidene)benzofuran-3(2H)-one
SMILES: Oc1ccc2C(=O)\C(Oc2c1)=C\c1cc(O)c(O)c(O)c1
InChI Key: InChIKey=SBVOOJGJEOGEBY-ACAGNQJTSA-N
Data: 1 KI
Activity Spreadsheet -- Enzyme Inhibition Constant Data from BindingDB
Found 1 hit for monomerid = 175351
Trg + Lig
Ki
nM
ΔG°
kcal/mole
IC50
nM
Kd
nM
EC50/IC50
nM
koff
s-1
kon
M-1s-1
pHTemp
°C
Aldehyde oxidase (AO)
(Cavia porcellus (Guinea pig))
BDBM175351
(3',4',5'-three-Hydroxyl Benzofuranone ...)
Show SMILES Oc1ccc2C(=O)\C(Oc2c1)=C\c1cc(O)c(O)c(O)c1
Show InChI InChI=1S/C15H10O6/c16-8-1-2-9-12(6-8)21-13(14(9)19)5-7-3-10(17)15(20)11(18)4-7/h1-6,16-18,20H/b13-5-
1.34E+5n/an/an/an/an/an/a7.0n/a
Kermanshah University of Medical Sciences
Assay Description
Guinea pig AO activity was assayed spectrophotometrically using phenanthridine as a substrate at 322 nm. All spectrophotometric determinations were c...
Bioorg Chem 64: 74-84 (2016)
Article DOI: 10.1016/j.bioorg.2015.12.004
BindingDB Entry DOI: 10.7270/Q2MP522Q