BDBM17596 2-(2,1,3-benzothiadiazole-4-sulfonamido)-5-bromobenzoic acid::sulfonamide compound, 2
SMILES: OC(=O)c1cc(Br)ccc1NS(=O)(=O)c1cccc2nsnc12
InChI Key: InChIKey=ZFMGFZJIHDSKHL-UHFFFAOYSA-N
Data: 1 IC50
Activity Spreadsheet -- Enzyme Inhibition Constant Data from BindingDB
Found 1 hit for monomerid = 17596
Trg + Lig
Ki
nM
ΔG°
kcal/mole
IC50
nM
Kd
nM
EC50/IC50
nM
koff
s-1
kon
M-1s-1
pHTemp
°C
Methionine aminopeptidase 2
(Homo sapiens (Human))
BDBM17596
(2-(2,1,3-benzothiadiazole-4-sulfonamido)-5-bromobe...)
Show SMILES OC(=O)c1cc(Br)ccc1NS(=O)(=O)c1cccc2nsnc12
Show InChI InChI=1S/C13H8BrN3O4S2/c14-7-4-5-9(8(6-7)13(18)19)17-23(20,21)11-3-1-2-10-12(11)16-22-15-10/h1-6,17H,(H,18,19)
Reactome pathway
n/an/a 3.90E+3n/an/an/an/a7.422
Abbott Laboratories
Assay Description
A coupled enzyme chromogenic assay was developed to measure methionine aminopeptidase-2 activity by monitoring the production of free methionine with...
Bioorg Med Chem Lett 16: 3574-7 (2006)
Article DOI: 10.1016/j.bmcl.2006.03.085
BindingDB Entry DOI: 10.7270/Q2TB1556