BDBM175995 US10047103, 75::US9605024, Example 28::US9688695, 28::US9688695, 75
SMILES: COc1nn2cc(nc2s1)-c1cc2c(OCc3csc(n3)-c3ccncc3)cc(OC)cc2o1
InChI Key: InChIKey=OLKUSWOEHSSOHD-UHFFFAOYSA-N
Data: 2 IC50  7 EC50
Activity Spreadsheet -- Enzyme Inhibition Constant Data from BindingDB
Found 9 hits for monomerid = 175995
Trg + Lig
Ki
nM
ΔG°
kcal/mole
IC50
nM
Kd
nM
EC50/IC50
nM
koff
s-1
kon
M-1s-1
pHTemp
°C
Proteinase-activated receptor 4
(Homo sapiens (Human))
BDBM175995
(US10047103, 75 | US9605024, Example 28 | US9688695...)
Show SMILES COc1nn2cc(nc2s1)-c1cc2c(OCc3csc(n3)-c3ccncc3)cc(OC)cc2o1
Show InChI InChI=1S/C23H17N5O4S2/c1-29-15-7-18(31-11-14-12-33-21(25-14)13-3-5-24-6-4-13)16-9-20(32-19(16)8-15)17-10-28-22(26-17)34-23(27-28)30-2/h3-10,12H,11H2,1-2H3
US Patent
n/an/an/an/a 0.320n/an/an/a25
Bristol-Myers Squibb Company; Universite de Montreal
US Patent
Assay Description
The activity of the PAR4 antagonists of the present invention were tested in PAR4 expressing cells by monitoring H-Ala-Phe(4-F)-Pro-Gly-Trp-Leu-Val-L...
US Patent US10047103 (2018)
BindingDB Entry DOI: 10.7270/Q2QF8VWN
Proteinase-activated receptor 4
(Homo sapiens (Human))
BDBM175995
(US10047103, 75 | US9605024, Example 28 | US9688695...)
Show SMILES COc1nn2cc(nc2s1)-c1cc2c(OCc3csc(n3)-c3ccncc3)cc(OC)cc2o1
Show InChI InChI=1S/C23H17N5O4S2/c1-29-15-7-18(31-11-14-12-33-21(25-14)13-3-5-24-6-4-13)16-9-20(32-19(16)8-15)17-10-28-22(26-17)34-23(27-28)30-2/h3-10,12H,11H2,1-2H3
US Patent
n/an/an/an/a 0.510n/an/an/a25
Bristol-Myers Squibb Company; Universite de Montreal
US Patent
Assay Description
The activity of the PAR4 antagonists of the present invention were tested in PAR4 expressing cells by monitoring H-Ala-Phe(4-F)-Pro-Gly-Trp-Leu-Val-L...
US Patent US10047103 (2018)
BindingDB Entry DOI: 10.7270/Q2QF8VWN
Proteinase-activated receptor 4
(Homo sapiens (Human))
BDBM175995
(US10047103, 75 | US9605024, Example 28 | US9688695...)
Show SMILES COc1nn2cc(nc2s1)-c1cc2c(OCc3csc(n3)-c3ccncc3)cc(OC)cc2o1
Show InChI InChI=1S/C23H17N5O4S2/c1-29-15-7-18(31-11-14-12-33-21(25-14)13-3-5-24-6-4-13)16-9-20(32-19(16)8-15)17-10-28-22(26-17)34-23(27-28)30-2/h3-10,12H,11H2,1-2H3
US Patent
n/an/an/an/a 0.510n/an/an/a25
BRISTOL-MYERS SQUIBB COMPANY
US Patent
Assay Description
Briefly, HEK293 EBNA PAR4 clone 20664.1J cells were plated 24 hrs. prior to experiment in 384 well, Poly-D-Lysine coated, black, clear bottom plates ...
US Patent US9688695 (2017)
BindingDB Entry DOI: 10.7270/Q28K777N
Proteinase-activated receptor 4
(Homo sapiens (Human))
BDBM175995
(US10047103, 75 | US9605024, Example 28 | US9688695...)
Show SMILES COc1nn2cc(nc2s1)-c1cc2c(OCc3csc(n3)-c3ccncc3)cc(OC)cc2o1
Show InChI InChI=1S/C23H17N5O4S2/c1-29-15-7-18(31-11-14-12-33-21(25-14)13-3-5-24-6-4-13)16-9-20(32-19(16)8-15)17-10-28-22(26-17)34-23(27-28)30-2/h3-10,12H,11H2,1-2H3
US Patent
n/an/an/an/a 0.320n/an/an/a25
BRISTOL-MYERS SQUIBB COMPANY
US Patent
Assay Description
Briefly, HEK293 EBNA PAR4 clone 20664.1J cells were plated 24 hrs. prior to experiment in 384 well, Poly-D-Lysine coated, black, clear bottom plates ...
US Patent US9688695 (2017)
BindingDB Entry DOI: 10.7270/Q28K777N
Proteinase-activated receptor 4
(Homo sapiens (Human))
BDBM175995
(US10047103, 75 | US9605024, Example 28 | US9688695...)
Show SMILES COc1nn2cc(nc2s1)-c1cc2c(OCc3csc(n3)-c3ccncc3)cc(OC)cc2o1
Show InChI InChI=1S/C23H17N5O4S2/c1-29-15-7-18(31-11-14-12-33-21(25-14)13-3-5-24-6-4-13)16-9-20(32-19(16)8-15)17-10-28-22(26-17)34-23(27-28)30-2/h3-10,12H,11H2,1-2H3
US Patent
n/an/an/an/a 0.510n/an/an/an/a
Bristol-Myers Squibb Company
US Patent
Assay Description
The activity of the PAR4 antagonists of the present invention were tested in PAR4 expressing cells by monitoring H-Ala-Phe(4-F)-Pro-Gly-Trp-Leu-Val-L...
US Patent US9605024 (2017)
BindingDB Entry DOI: 10.7270/Q25D8TWX
Proteinase-activated receptor 4
(Homo sapiens (Human))
BDBM175995
(US10047103, 75 | US9605024, Example 28 | US9688695...)
Show SMILES COc1nn2cc(nc2s1)-c1cc2c(OCc3csc(n3)-c3ccncc3)cc(OC)cc2o1
Show InChI InChI=1S/C23H17N5O4S2/c1-29-15-7-18(31-11-14-12-33-21(25-14)13-3-5-24-6-4-13)16-9-20(32-19(16)8-15)17-10-28-22(26-17)34-23(27-28)30-2/h3-10,12H,11H2,1-2H3
US Patent
n/an/an/an/a 1.60n/an/an/a25
BRISTOL-MYERS SQUIBB COMPANY
US Patent
Assay Description
Briefly, PRP or washed platelet suspension (100 μl) was pre-incubated for 5 minutes at room temperature with varying concentrations of compounds...
US Patent US9688695 (2017)
BindingDB Entry DOI: 10.7270/Q28K777N
Prothrombin
(Homo sapiens (Human))
BDBM175995
(US10047103, 75 | US9605024, Example 28 | US9688695...)
Show SMILES COc1nn2cc(nc2s1)-c1cc2c(OCc3csc(n3)-c3ccncc3)cc(OC)cc2o1
Show InChI InChI=1S/C23H17N5O4S2/c1-29-15-7-18(31-11-14-12-33-21(25-14)13-3-5-24-6-4-13)16-9-20(32-19(16)8-15)17-10-28-22(26-17)34-23(27-28)30-2/h3-10,12H,11H2,1-2H3
US Patent
n/an/a 2.90n/an/an/an/an/a25
Bristol-Myers Squibb Company; Universite de Montreal
US Patent
Assay Description
The ability of the compounds of the current invention to inhibit platelet aggregation induced by gamma-thrombin was tested in a 96-well microplate ag...
US Patent US10047103 (2018)
BindingDB Entry DOI: 10.7270/Q2QF8VWN
Prothrombin
(Homo sapiens (Human))
BDBM175995
(US10047103, 75 | US9605024, Example 28 | US9688695...)
Show SMILES COc1nn2cc(nc2s1)-c1cc2c(OCc3csc(n3)-c3ccncc3)cc(OC)cc2o1
Show InChI InChI=1S/C23H17N5O4S2/c1-29-15-7-18(31-11-14-12-33-21(25-14)13-3-5-24-6-4-13)16-9-20(32-19(16)8-15)17-10-28-22(26-17)34-23(27-28)30-2/h3-10,12H,11H2,1-2H3
US Patent
n/an/a 1.60n/an/an/an/an/a25
Bristol-Myers Squibb Company; Universite de Montreal
US Patent
Assay Description
The ability of the compounds of the current invention to inhibit platelet aggregation induced by gamma-thrombin was tested in a 96-well microplate ag...
US Patent US10047103 (2018)
BindingDB Entry DOI: 10.7270/Q2QF8VWN
Proteinase-activated receptor 4
(Homo sapiens (Human))
BDBM175995
(US10047103, 75 | US9605024, Example 28 | US9688695...)
Show SMILES COc1nn2cc(nc2s1)-c1cc2c(OCc3csc(n3)-c3ccncc3)cc(OC)cc2o1
Show InChI InChI=1S/C23H17N5O4S2/c1-29-15-7-18(31-11-14-12-33-21(25-14)13-3-5-24-6-4-13)16-9-20(32-19(16)8-15)17-10-28-22(26-17)34-23(27-28)30-2/h3-10,12H,11H2,1-2H3
US Patent
n/an/an/an/a 2.90n/an/an/a25
BRISTOL-MYERS SQUIBB COMPANY
US Patent
Assay Description
Briefly, PRP or washed platelet suspension (100 μl) was pre-incubated for 5 minutes at room temperature with varying concentrations of compounds...
US Patent US9688695 (2017)
BindingDB Entry DOI: 10.7270/Q28K777N