null
SMILES: CNC(=O)c1ccc(cc1)-c1nc(COc2cc(OC)cc3oc(cc23)-c2cn3nc(OC)sc3n2)cs1
InChI Key: InChIKey=GPISVVPOYSSYDY-UHFFFAOYSA-N
Activity Spreadsheet -- Enzyme Inhibition Constant Data from BindingDB
Found 3 hits for monomerid = 176007
Trg + Lig
Ki
nM
ΔG°
kcal/mole
IC50
nM
Kd
nM
EC50/IC50
nM
koff
s-1
kon
M-1s-1
pHTemp
°C
Proteinase-activated receptor 4
(Homo sapiens (Human))
BDBM176007
(US10047103, 40 | US9688695, 40)
Show SMILES CNC(=O)c1ccc(cc1)-c1nc(COc2cc(OC)cc3oc(cc23)-c2cn3nc(OC)sc3n2)cs1
Show InChI InChI=1S/C26H21N5O5S2/c1-27-23(32)14-4-6-15(7-5-14)24-28-16(13-37-24)12-35-20-8-17(33-2)9-21-18(20)10-22(36-21)19-11-31-25(29-19)38-26(30-31)34-3/h4-11,13H,12H2,1-3H3,(H,27,32)
US Patent
n/an/an/an/a 0.260n/an/an/a25
Bristol-Myers Squibb Company; Universite de Montreal
US Patent
Assay Description
The activity of the PAR4 antagonists of the present invention were tested in PAR4 expressing cells by monitoring H-Ala-Phe(4-F)-Pro-Gly-Trp-Leu-Val-L...
US Patent US10047103 (2018)
BindingDB Entry DOI: 10.7270/Q2QF8VWN
Proteinase-activated receptor 4
(Homo sapiens (Human))
BDBM176007
(US10047103, 40 | US9688695, 40)
Show SMILES CNC(=O)c1ccc(cc1)-c1nc(COc2cc(OC)cc3oc(cc23)-c2cn3nc(OC)sc3n2)cs1
Show InChI InChI=1S/C26H21N5O5S2/c1-27-23(32)14-4-6-15(7-5-14)24-28-16(13-37-24)12-35-20-8-17(33-2)9-21-18(20)10-22(36-21)19-11-31-25(29-19)38-26(30-31)34-3/h4-11,13H,12H2,1-3H3,(H,27,32)
n/an/a 0.400n/an/an/an/an/an/a
TBA
Citation and Details
Article DOI: 10.1021/acs.jmedchem.2c00359
BindingDB Entry DOI: 10.7270/Q2VH5SWM
Proteinase-activated receptor 4
(Homo sapiens (Human))
BDBM176007
(US10047103, 40 | US9688695, 40)
Show SMILES CNC(=O)c1ccc(cc1)-c1nc(COc2cc(OC)cc3oc(cc23)-c2cn3nc(OC)sc3n2)cs1
Show InChI InChI=1S/C26H21N5O5S2/c1-27-23(32)14-4-6-15(7-5-14)24-28-16(13-37-24)12-35-20-8-17(33-2)9-21-18(20)10-22(36-21)19-11-31-25(29-19)38-26(30-31)34-3/h4-11,13H,12H2,1-3H3,(H,27,32)
US Patent
n/an/an/an/a 0.260n/an/an/a25
BRISTOL-MYERS SQUIBB COMPANY
US Patent
Assay Description
Briefly, HEK293 EBNA PAR4 clone 20664.1J cells were plated 24 hrs. prior to experiment in 384 well, Poly-D-Lysine coated, black, clear bottom plates ...
US Patent US9688695 (2017)
BindingDB Entry DOI: 10.7270/Q28K777N