BDBM17604 2-[(4-fluorobenzene)sulfonamido]naphthalene-1-carboxylic acid::sulfonamide compound, 10
SMILES: OC(=O)c1c(NS(=O)(=O)c2ccc(F)cc2)ccc2ccccc12
InChI Key: InChIKey=KIYWIXCUCALPGQ-UHFFFAOYSA-N
Data: 1 IC50
Activity Spreadsheet -- Enzyme Inhibition Constant Data from BindingDB
Found 1 hit for monomerid = 17604
Trg + Lig
Ki
nM
ΔG°
kcal/mole
IC50
nM
Kd
nM
EC50/IC50
nM
koff
s-1
kon
M-1s-1
pHTemp
°C
Methionine aminopeptidase 2
(Homo sapiens (Human))
BDBM17604
(2-[(4-fluorobenzene)sulfonamido]naphthalene-1-carb...)
Show SMILES OC(=O)c1c(NS(=O)(=O)c2ccc(F)cc2)ccc2ccccc12
Show InChI InChI=1S/C17H12FNO4S/c18-12-6-8-13(9-7-12)24(22,23)19-15-10-5-11-3-1-2-4-14(11)16(15)17(20)21/h1-10,19H,(H,20,21)
Reactome pathway
n/an/a 15n/an/an/an/a7.422
Abbott Laboratories
Assay Description
A coupled enzyme chromogenic assay was developed to measure methionine aminopeptidase-2 activity by monitoring the production of free methionine with...
Bioorg Med Chem Lett 16: 3574-7 (2006)
Article DOI: 10.1016/j.bmcl.2006.03.085
BindingDB Entry DOI: 10.7270/Q2TB1556