BDBM176628 US9115121, 19
SMILES: COc1nc(NCCc2ccc(F)cc2)nc(n1)-c1cc2cc(Cl)ccc2[nH]1
InChI Key: InChIKey=DCYSTLSPGFZECB-UHFFFAOYSA-N
Data: 1 IC50
Activity Spreadsheet -- Enzyme Inhibition Constant Data from BindingDB
Found 1 hit for monomerid = 176628
Trg + Lig
Ki
nM
ΔG°
kcal/mole
IC50
nM
Kd
nM
EC50/IC50
nM
koff
s-1
kon
M-1s-1
pHTemp
°C
Cannabinoid receptor 2
(Homo sapiens (Human))
BDBM176628
(US9115121, 19)
Show SMILES COc1nc(NCCc2ccc(F)cc2)nc(n1)-c1cc2cc(Cl)ccc2[nH]1
Show InChI InChI=1S/C20H17ClFN5O/c1-28-20-26-18(17-11-13-10-14(21)4-7-16(13)24-17)25-19(27-20)23-9-8-12-2-5-15(22)6-3-12/h2-7,10-11,24H,8-9H2,1H3,(H,23,25,26,27)
Reactome pathway
US Patent
n/an/a 14n/an/an/an/an/an/a
Sanofi
US Patent
Assay Description
Affinity binding tests were performed according to the experimental conditions described by M. Rinaldi-Carmona in J. Pharmacol. Exp. Therap. 1998, 28...
US Patent US9115121 (2015)
BindingDB Entry DOI: 10.7270/Q23N225X