null
SMILES: COc1nc(NCCc2ccc(F)cc2)nc(n1)-c1cc2cc(ccc2[nH]1)C#N
InChI Key: InChIKey=PAUMQIQHEXBOQV-UHFFFAOYSA-N
Activity Spreadsheet -- Enzyme Inhibition Constant Data from BindingDB
Found 1 hit for monomerid = 176633
Trg + Lig
Ki
nM
ΔG°
kcal/mole
IC50
nM
Kd
nM
EC50/IC50
nM
koff
s-1
kon
M-1s-1
pHTemp
°C
Cannabinoid receptor 2
(Homo sapiens (Human))
BDBM176633
(US9115121, 25)
Show SMILES COc1nc(NCCc2ccc(F)cc2)nc(n1)-c1cc2cc(ccc2[nH]1)C#N
Show InChI InChI=1S/C21H17FN6O/c1-29-21-27-19(18-11-15-10-14(12-23)4-7-17(15)25-18)26-20(28-21)24-9-8-13-2-5-16(22)6-3-13/h2-7,10-11,25H,8-9H2,1H3,(H,24,26,27,28)
Reactome pathway
US Patent
n/an/a 27n/an/an/an/an/an/a
Sanofi
US Patent
Assay Description
Affinity binding tests were performed according to the experimental conditions described by M. Rinaldi-Carmona in J. Pharmacol. Exp. Therap. 1998, 28...
US Patent US9115121 (2015)
BindingDB Entry DOI: 10.7270/Q23N225X