null
SMILES: COc1nc(NCCc2ccc(OC(F)F)cc2)nc(n1)-c1cc2c(Cl)cccc2[nH]1
InChI Key: InChIKey=BXDFCRFFBIZFQL-UHFFFAOYSA-N
Activity Spreadsheet -- Enzyme Inhibition Constant Data from BindingDB
Found 1 hit for monomerid = 176650
Trg + Lig
Ki
nM
ΔG°
kcal/mole
IC50
nM
Kd
nM
EC50/IC50
nM
koff
s-1
kon
M-1s-1
pHTemp
°C
Cannabinoid receptor 2
(Homo sapiens (Human))
BDBM176650
(US9115121, 42)
Show SMILES COc1nc(NCCc2ccc(OC(F)F)cc2)nc(n1)-c1cc2c(Cl)cccc2[nH]1
Show InChI InChI=1S/C21H18ClF2N5O2/c1-30-21-28-18(17-11-14-15(22)3-2-4-16(14)26-17)27-20(29-21)25-10-9-12-5-7-13(8-6-12)31-19(23)24/h2-8,11,19,26H,9-10H2,1H3,(H,25,27,28,29)
Reactome pathway
US Patent
n/an/a 24n/an/an/an/an/an/a
Sanofi
US Patent
Assay Description
Affinity binding tests were performed according to the experimental conditions described by M. Rinaldi-Carmona in J. Pharmacol. Exp. Therap. 1998, 28...
US Patent US9115121 (2015)
BindingDB Entry DOI: 10.7270/Q23N225X