BDBM176671 US9115121, 70
SMILES: COc1nc(NCCc2ccc(OCF)cc2)nc(n1)-c1ccc(OC)c(c1)C(C)(C)O
InChI Key: InChIKey=YUCMYVVENLRMJC-UHFFFAOYSA-N
Data: 1 IC50
Activity Spreadsheet -- Enzyme Inhibition Constant Data from BindingDB
Found 1 hit for monomerid = 176671
Trg + Lig
Ki
nM
ΔG°
kcal/mole
IC50
nM
Kd
nM
EC50/IC50
nM
koff
s-1
kon
M-1s-1
pHTemp
°C
Cannabinoid receptor 2
(Homo sapiens (Human))
BDBM176671
(US9115121, 70)
Show SMILES COc1nc(NCCc2ccc(OCF)cc2)nc(n1)-c1ccc(OC)c(c1)C(C)(C)O
Show InChI InChI=1S/C23H27FN4O4/c1-23(2,29)18-13-16(7-10-19(18)30-3)20-26-21(28-22(27-20)31-4)25-12-11-15-5-8-17(9-6-15)32-14-24/h5-10,13,29H,11-12,14H2,1-4H3,(H,25,26,27,28)
Reactome pathway
US Patent
n/an/a 9n/an/an/an/an/an/a
Sanofi
US Patent
Assay Description
Affinity binding tests were performed according to the experimental conditions described by M. Rinaldi-Carmona in J. Pharmacol. Exp. Therap. 1998, 28...
US Patent US9115121 (2015)
BindingDB Entry DOI: 10.7270/Q23N225X