BDBM17671 benzimidazole analogue, 50::methyl 2-(2,6-difluorophenyl)-1-[(2,6-difluorophenyl)methyl]-1H-1,3-benzodiazole-4-carboxylate
SMILES: COC(=O)c1cccc2n(Cc3c(F)cccc3F)c(nc12)-c1c(F)cccc1F
InChI Key: InChIKey=ARZDBTKIMHITPH-UHFFFAOYSA-N
Data: 1 IC50
Activity Spreadsheet -- Enzyme Inhibition Constant Data from BindingDB
Found 1 hit for monomerid = 17671
Trg + Lig
Ki
nM
ΔG°
kcal/mole
IC50
nM
Kd
nM
EC50/IC50
nM
koff
s-1
kon
M-1s-1
pHTemp
°C
HIV-1 Reverse Transcriptase
(Human immunodeficiency virus type 1)
BDBM17671
(benzimidazole analogue, 50 | methyl 2-(2,6-difluor...)
Show SMILES COC(=O)c1cccc2n(Cc3c(F)cccc3F)c(nc12)-c1c(F)cccc1F |(2.54,8.57,;1.21,7.81,;1.21,6.27,;2.54,5.49,;-.12,5.5,;-1.46,6.27,;-2.79,5.5,;-2.79,3.95,;-1.46,3.18,;-1.14,1.68,;-1.91,.34,;-3.45,.39,;-4.22,1.72,;-3.45,3.05,;-5.76,1.72,;-6.53,.39,;-5.76,-.95,;-4.22,-.95,;-3.45,-2.28,;.39,1.52,;1.02,2.92,;-.12,3.95,;1.16,.18,;2.7,.18,;3.47,1.52,;3.47,-1.15,;2.7,-2.48,;1.16,-2.48,;.39,-1.15,;-1.15,-1.15,)|
Show InChI InChI=1S/C22H14F4N2O2/c1-30-22(29)12-5-2-10-18-20(12)27-21(19-16(25)8-4-9-17(19)26)28(18)11-13-14(23)6-3-7-15(13)24/h2-10H,11H2,1H3
n/an/a 1.58E+5n/an/an/an/a8.037
NCI-FCRDC
Assay Description
The IC50 of reverse transcriptase is the concentration that inhibits 50% of recombinant HIV-1 RT RNA-directed DNA polymerase activity in vitro.
J Med Chem 50: 4003-4015 (2007)
Article DOI: 10.1021/jm060103d
BindingDB Entry DOI: 10.7270/Q25M6409