BDBM17672 2-(2,6-difluorophenyl)-1-[(2,6-difluorophenyl)methyl]-1H-1,3-benzodiazol-4-amine::CHEMBL293984::benzimidazole analogue, 53
SMILES: Nc1cccc2n(Cc3c(F)cccc3F)c(nc12)-c1c(F)cccc1F
InChI Key: InChIKey=DVBVMVZJNSPCMP-UHFFFAOYSA-N
Data: 1 IC50  1 EC50
Activity Spreadsheet -- Enzyme Inhibition Constant Data from BindingDB
Found 2 hits for monomerid = 17672
Trg + Lig
Ki
nM
ΔG°
kcal/mole
IC50
nM
Kd
nM
EC50/IC50
nM
koff
s-1
kon
M-1s-1
pHTemp
°C
Human immunodeficiency virus type 1 reverse transcriptase
(Human immunodeficiency virus 1)
BDBM17672
(2-(2,6-difluorophenyl)-1-[(2,6-difluorophenyl)meth...)
Show SMILES Nc1cccc2n(Cc3c(F)cccc3F)c(nc12)-c1c(F)cccc1F |(1.21,6.27,;-.12,5.5,;-1.46,6.27,;-2.79,5.5,;-2.79,3.95,;-1.46,3.18,;-1.14,1.68,;-1.91,.34,;-3.45,.39,;-4.22,1.72,;-3.45,3.05,;-5.76,1.72,;-6.53,.39,;-5.76,-.95,;-4.22,-.95,;-3.45,-2.28,;.39,1.52,;1.02,2.92,;-.12,3.95,;1.16,.18,;2.7,.18,;3.47,1.52,;3.47,-1.15,;2.7,-2.48,;1.16,-2.48,;.39,-1.15,;-1.15,-1.15,)|
Show InChI InChI=1S/C20H13F4N3/c21-12-4-1-5-13(22)11(12)10-27-17-9-3-8-16(25)19(17)26-20(27)18-14(23)6-2-7-15(18)24/h1-9H,10,25H2
n/an/an/an/a 530n/an/an/an/a
National Cancer Institute-Frederick
Curated by ChEMBL
Assay Description
Inhibition of HIV-1 reverse transcriptase.
J Med Chem 46: 1940-7 (2003)
Article DOI: 10.1021/jm020271f
BindingDB Entry DOI: 10.7270/Q2610ZPC
HIV-1 Reverse Transcriptase
(Human immunodeficiency virus type 1)
BDBM17672
(2-(2,6-difluorophenyl)-1-[(2,6-difluorophenyl)meth...)
Show SMILES Nc1cccc2n(Cc3c(F)cccc3F)c(nc12)-c1c(F)cccc1F |(1.21,6.27,;-.12,5.5,;-1.46,6.27,;-2.79,5.5,;-2.79,3.95,;-1.46,3.18,;-1.14,1.68,;-1.91,.34,;-3.45,.39,;-4.22,1.72,;-3.45,3.05,;-5.76,1.72,;-6.53,.39,;-5.76,-.95,;-4.22,-.95,;-3.45,-2.28,;.39,1.52,;1.02,2.92,;-.12,3.95,;1.16,.18,;2.7,.18,;3.47,1.52,;3.47,-1.15,;2.7,-2.48,;1.16,-2.48,;.39,-1.15,;-1.15,-1.15,)|
Show InChI InChI=1S/C20H13F4N3/c21-12-4-1-5-13(22)11(12)10-27-17-9-3-8-16(25)19(17)26-20(27)18-14(23)6-2-7-15(18)24/h1-9H,10,25H2
n/an/a 280n/an/an/an/a8.037
NCI-FCRDC
Assay Description
The IC50 of reverse transcriptase is the concentration that inhibits 50% of recombinant HIV-1 RT RNA-directed DNA polymerase activity in vitro.
J Med Chem 50: 4003-4015 (2007)
Article DOI: 10.1021/jm060103d
BindingDB Entry DOI: 10.7270/Q25M6409