BDBM17739 2,6-dimethylphenyl N-(2,4-dimethoxyphenyl)-N-[2-({3-fluoro-4-[2-(4-methylpiperazin-1-yl)ethoxy]phenyl}amino)pyrimidin-4-yl]carbamate::2-aminopyrimidine carbamate, 38
SMILES: COc1ccc(N(C(=O)Oc2c(C)cccc2C)c2ccnc(Nc3ccc(OCCN4CCN(C)CC4)c(F)c3)n2)c(OC)c1
InChI Key: InChIKey=CVTIVBFOLJQENW-UHFFFAOYSA-N
Data: 4 IC50
Activity Spreadsheet -- Enzyme Inhibition Constant Data from BindingDB
Found 4 hits for monomerid = 17739
Trg + Lig
Ki
nM
ΔG°
kcal/mole
IC50
nM
Kd
nM
EC50/IC50
nM
koff
s-1
kon
M-1s-1
pHTemp
°C
Tyrosine-protein kinase Lck
(Homo sapiens (Human))
BDBM17739
(2,6-dimethylphenyl N-(2,4-dimethoxyphenyl)-N-[2-({...)
Show SMILES COc1ccc(N(C(=O)Oc2c(C)cccc2C)c2ccnc(Nc3ccc(OCCN4CCN(C)CC4)c(F)c3)n2)c(OC)c1
Show InChI InChI=1S/C34H39FN6O5/c1-23-7-6-8-24(2)32(23)46-34(42)41(28-11-10-26(43-4)22-30(28)44-5)31-13-14-36-33(38-31)37-25-9-12-29(27(35)21-25)45-20-19-40-17-15-39(3)16-18-40/h6-14,21-22H,15-20H2,1-5H3,(H,36,37,38)
n/an/a 1n/an/an/an/a7.522
Amgen
Assay Description
The assay involves the phosphorylation of a biotinylated substrate and the detection of this phosphorylation after the addition of a streptavidin-all...
J Med Chem 49: 4981-91 (2006)
Article DOI: 10.1021/jm060435i
BindingDB Entry DOI: 10.7270/Q2SB440C
Vascular endothelial growth factor receptor 2
(Homo sapiens (Human))
BDBM17739
(2,6-dimethylphenyl N-(2,4-dimethoxyphenyl)-N-[2-({...)
Show SMILES COc1ccc(N(C(=O)Oc2c(C)cccc2C)c2ccnc(Nc3ccc(OCCN4CCN(C)CC4)c(F)c3)n2)c(OC)c1
Show InChI InChI=1S/C34H39FN6O5/c1-23-7-6-8-24(2)32(23)46-34(42)41(28-11-10-26(43-4)22-30(28)44-5)31-13-14-36-33(38-31)37-25-9-12-29(27(35)21-25)45-20-19-40-17-15-39(3)16-18-40/h6-14,21-22H,15-20H2,1-5H3,(H,36,37,38)
NCI pathway
Reactome pathway
n/an/a 570n/an/an/an/an/an/a
Amgen
Assay Description
The assay involves the phosphorylation of a biotinylated substrate and the detection of this phosphorylation after the addition of a streptavidin-all...
J Med Chem 49: 4981-91 (2006)
Article DOI: 10.1021/jm060435i
BindingDB Entry DOI: 10.7270/Q2SB440C
Mitogen-activated protein kinase 14
(Homo sapiens (Human))
BDBM17739
(2,6-dimethylphenyl N-(2,4-dimethoxyphenyl)-N-[2-({...)
Show SMILES COc1ccc(N(C(=O)Oc2c(C)cccc2C)c2ccnc(Nc3ccc(OCCN4CCN(C)CC4)c(F)c3)n2)c(OC)c1
Show InChI InChI=1S/C34H39FN6O5/c1-23-7-6-8-24(2)32(23)46-34(42)41(28-11-10-26(43-4)22-30(28)44-5)31-13-14-36-33(38-31)37-25-9-12-29(27(35)21-25)45-20-19-40-17-15-39(3)16-18-40/h6-14,21-22H,15-20H2,1-5H3,(H,36,37,38)
NCI pathway
Reactome pathway
n/an/a 3.00E+3n/an/an/an/an/an/a
Amgen
Assay Description
The assay involves the phosphorylation of a biotinylated substrate and the detection of this phosphorylation after the addition of a streptavidin-all...
J Med Chem 49: 4981-91 (2006)
Article DOI: 10.1021/jm060435i
BindingDB Entry DOI: 10.7270/Q2SB440C
Proto-oncogene tyrosine-protein kinase Src
(Homo sapiens (Human))
BDBM17739
(2,6-dimethylphenyl N-(2,4-dimethoxyphenyl)-N-[2-({...)
Show SMILES COc1ccc(N(C(=O)Oc2c(C)cccc2C)c2ccnc(Nc3ccc(OCCN4CCN(C)CC4)c(F)c3)n2)c(OC)c1
Show InChI InChI=1S/C34H39FN6O5/c1-23-7-6-8-24(2)32(23)46-34(42)41(28-11-10-26(43-4)22-30(28)44-5)31-13-14-36-33(38-31)37-25-9-12-29(27(35)21-25)45-20-19-40-17-15-39(3)16-18-40/h6-14,21-22H,15-20H2,1-5H3,(H,36,37,38)
n/an/a 6n/an/an/an/an/an/a
Amgen
Assay Description
The assay involves the phosphorylation of a biotinylated substrate and the detection of this phosphorylation after the addition of a streptavidin-all...
J Med Chem 49: 4981-91 (2006)
Article DOI: 10.1021/jm060435i
BindingDB Entry DOI: 10.7270/Q2SB440C