BDBM17751 6-chloro-3-(3-methyl-1,2-oxazol-5-yl)-4-phenyl-1,2-dihydroquinolin-2-one::Quinolone, 2
SMILES: Cc1cc(on1)-c1c(-c2ccccc2)c2cc(Cl)ccc2[nH]c1=O
InChI Key: InChIKey=QINNOQKHPLWGBK-UHFFFAOYSA-N
Data: 2 IC50
PDB links: 1 PDB ID matches this monomer.
Activity Spreadsheet -- Enzyme Inhibition Constant Data from BindingDB
Found 2 hits for monomerid = 17751
Trg + Lig
Ki
nM
ΔG°
kcal/mole
IC50
nM
Kd
nM
EC50/IC50
nM
koff
s-1
kon
M-1s-1
pHTemp
°C
Macrophage colony stimulating factor receptor
(Homo sapiens (Human))
BDBM17751
(6-chloro-3-(3-methyl-1,2-oxazol-5-yl)-4-phenyl-1,2...)
Show SMILES Cc1cc(on1)-c1c(-c2ccccc2)c2cc(Cl)ccc2[nH]c1=O
Show InChI InChI=1S/C19H13ClN2O2/c1-11-9-16(24-22-11)18-17(12-5-3-2-4-6-12)14-10-13(20)7-8-15(14)21-19(18)23/h2-10H,1H3,(H,21,23)
n/an/a 140n/an/an/an/an/an/a
Johnson& Johnson Pharmaceutical Research& Development
Curated by ChEMBL
Assay Description
Inhibition of human cytoplasmic macrophage colony-stimulating factor 1 receptor by fluorescence polarization
Bioorg Med Chem Lett 18: 2097-102 (2008)
Article DOI: 10.1016/j.bmcl.2008.01.088
BindingDB Entry DOI: 10.7270/Q23779JH
Macrophage colony stimulating factor receptor
(Homo sapiens (Human))
BDBM17751
(6-chloro-3-(3-methyl-1,2-oxazol-5-yl)-4-phenyl-1,2...)
Show SMILES Cc1cc(on1)-c1c(-c2ccccc2)c2cc(Cl)ccc2[nH]c1=O
Show InChI InChI=1S/C19H13ClN2O2/c1-11-9-16(24-22-11)18-17(12-5-3-2-4-6-12)14-10-13(20)7-8-15(14)21-19(18)23/h2-10H,1H3,(H,21,23)
n/an/a 160n/an/an/an/a7.522
Johnson & Johnson Pharmaceutical
Assay Description
The full-length cFMS cytoplasmic domain (FMS.538-972.6His) was incubated with compound in reaction buffer. Control reactions were run in each plate. ...
J Biol Chem 282: 4094-101 (2007)
Article DOI: 10.1074/jbc.M608183200
BindingDB Entry DOI: 10.7270/Q2HT2MKC