BDBM177833 US9120791, Example 52::US9603854, 52
SMILES: CN(C)C[C@@H]1Cc2ccccc2CN1C(=O)c1ccc(Cl)cc1-c1cc(C(=O)N(c2ccc(O)cc2)c2ccc3n(C)ccc3c2)c2CCCCn12
InChI Key: InChIKey=WPEONBMHCNCLCX-UMSFTDKQSA-N
Data: 2 IC50
Activity Spreadsheet -- Enzyme Inhibition Constant Data from BindingDB
Found 2 hits for monomerid = 177833
Trg + Lig
Ki
nM
ΔG°
kcal/mole
IC50
nM
Kd
nM
EC50/IC50
nM
koff
s-1
kon
M-1s-1
pHTemp
°C
Apoptosis regulator Bcl-2
(Homo sapiens (Human))
BDBM177833
(US9120791, Example 52 | US9603854, 52)
Show SMILES CN(C)C[C@@H]1Cc2ccccc2CN1C(=O)c1ccc(Cl)cc1-c1cc(C(=O)N(c2ccc(O)cc2)c2ccc3n(C)ccc3c2)c2CCCCn12
Show InChI InChI=1S/C43H42ClN5O3/c1-45(2)27-34-22-28-8-4-5-9-30(28)26-48(34)42(51)36-17-11-31(44)24-37(36)41-25-38(40-10-6-7-20-47(40)41)43(52)49(32-12-15-35(50)16-13-32)33-14-18-39-29(23-33)19-21-46(39)3/h4-5,8-9,11-19,21,23-25,34,50H,6-7,10,20,22,26-27H2,1-3H3/t34-/m0/s1
US Patent
n/an/a 16n/an/an/an/an/an/a
LES LABORATOIRES SERVIER; VERNALIS (R&D) LTD
US Patent
Assay Description
The fluorescence polarisation tests were carried out on microplates (384 wells). The Bcl-2 protein, at a final concentration of 2.50×10−8 M, is...
US Patent US9603854 (2017)
BindingDB Entry DOI: 10.7270/Q2GX4DMT
Apoptosis regulator Bcl-2
(Mus musculus (Mouse))
BDBM177833
(US9120791, Example 52 | US9603854, 52)
Show SMILES CN(C)C[C@@H]1Cc2ccccc2CN1C(=O)c1ccc(Cl)cc1-c1cc(C(=O)N(c2ccc(O)cc2)c2ccc3n(C)ccc3c2)c2CCCCn12
Show InChI InChI=1S/C43H42ClN5O3/c1-45(2)27-34-22-28-8-4-5-9-30(28)26-48(34)42(51)36-17-11-31(44)24-37(36)41-25-38(40-10-6-7-20-47(40)41)43(52)49(32-12-15-35(50)16-13-32)33-14-18-39-29(23-33)19-21-46(39)3/h4-5,8-9,11-19,21,23-25,34,50H,6-7,10,20,22,26-27H2,1-3H3/t34-/m0/s1
US Patent
n/an/a 16n/an/an/an/a7.4n/a
LES LABORATOIRES SERVIER; VERNALIS (R&D) LTD
US Patent
Assay Description
The fluorescence polarisation tests were carried out on microplates (384 wells). The Bcl-2 protein, at a final concentration of 2.50×10−8 M, is...
US Patent US9120791 (2015)
BindingDB Entry DOI: 10.7270/Q21N7ZWC