null
SMILES: Cn1ccc2cc(ccc12)N(C(=O)c1cc(-c2cc3OCOc3cc2C(=O)N2Cc3ccccc3C[C@H]2CN2CCOCC2)n2ccccc12)c1ccc(O)cc1
InChI Key: InChIKey=DUJZKQREHATVMW-DHUJRADRSA-N
Activity Spreadsheet -- Enzyme Inhibition Constant Data from BindingDB
Found 2 hits for monomerid = 177840
Trg + Lig
Ki
nM
ΔG°
kcal/mole
IC50
nM
Kd
nM
EC50/IC50
nM
koff
s-1
kon
M-1s-1
pHTemp
°C
Apoptosis regulator Bcl-2
(Homo sapiens (Human))
BDBM177840
(US9120791, Example 59 | US9603854, 59)
Show SMILES Cn1ccc2cc(ccc12)N(C(=O)c1cc(-c2cc3OCOc3cc2C(=O)N2Cc3ccccc3C[C@H]2CN2CCOCC2)n2ccccc12)c1ccc(O)cc1
Show InChI InChI=1S/C46H41N5O6/c1-47-17-15-31-23-34(11-14-40(31)47)51(33-9-12-36(52)13-10-33)46(54)39-24-42(49-16-5-4-8-41(39)49)37-25-43-44(57-29-56-43)26-38(37)45(53)50-27-32-7-3-2-6-30(32)22-35(50)28-48-18-20-55-21-19-48/h2-17,23-26,35,52H,18-22,27-29H2,1H3/t35-/m0/s1
US Patent
n/an/a 13n/an/an/an/an/an/a
LES LABORATOIRES SERVIER; VERNALIS (R&D) LTD
US Patent
Assay Description
The fluorescence polarisation tests were carried out on microplates (384 wells). The Bcl-2 protein, at a final concentration of 2.50×10−8 M, is...
US Patent US9603854 (2017)
BindingDB Entry DOI: 10.7270/Q2GX4DMT
Apoptosis regulator Bcl-2
(Mus musculus (Mouse))
BDBM177840
(US9120791, Example 59 | US9603854, 59)
Show SMILES Cn1ccc2cc(ccc12)N(C(=O)c1cc(-c2cc3OCOc3cc2C(=O)N2Cc3ccccc3C[C@H]2CN2CCOCC2)n2ccccc12)c1ccc(O)cc1
Show InChI InChI=1S/C46H41N5O6/c1-47-17-15-31-23-34(11-14-40(31)47)51(33-9-12-36(52)13-10-33)46(54)39-24-42(49-16-5-4-8-41(39)49)37-25-43-44(57-29-56-43)26-38(37)45(53)50-27-32-7-3-2-6-30(32)22-35(50)28-48-18-20-55-21-19-48/h2-17,23-26,35,52H,18-22,27-29H2,1H3/t35-/m0/s1
US Patent
n/an/a 13n/an/an/an/a7.4n/a
LES LABORATOIRES SERVIER; VERNALIS (R&D) LTD
US Patent
Assay Description
The fluorescence polarisation tests were carried out on microplates (384 wells). The Bcl-2 protein, at a final concentration of 2.50×10−8 M, is...
US Patent US9120791 (2015)
BindingDB Entry DOI: 10.7270/Q21N7ZWC