BDBM17789 benzimidazole-urea, 17::methyl N-{6-[4-({[2-fluoro-5-(trifluoromethyl)phenyl]carbamoyl}amino)phenoxy]-1H-1,3-benzodiazol-2-yl}carbamate
SMILES: COC(=O)Nc1nc2ccc(Oc3ccc(NC(=O)Nc4cc(ccc4F)C(F)(F)F)cc3)cc2[nH]1
InChI Key: InChIKey=KADQEUOYNAPXRD-UHFFFAOYSA-N
Data: 4 IC50
PDB links: 1 PDB ID matches this monomer. 1 PDB ID contains inhibitors having a similarity of 90% to this monomer.
Activity Spreadsheet -- Enzyme Inhibition Constant Data from BindingDB
Found 4 hits for monomerid = 17789
Trg + Lig
Ki
nM
ΔG°
kcal/mole
IC50
nM
Kd
nM
EC50/IC50
nM
koff
s-1
kon
M-1s-1
pHTemp
°C
Angiopoietin-1 receptor
(Homo sapiens (Human))
BDBM17789
(benzimidazole-urea, 17 | methyl N-{6-[4-({[2-fluor...)
Show SMILES COC(=O)Nc1nc2ccc(Oc3ccc(NC(=O)Nc4cc(ccc4F)C(F)(F)F)cc3)cc2[nH]1
Show InChI InChI=1S/C23H17F4N5O4/c1-35-22(34)32-20-29-17-9-7-15(11-19(17)30-20)36-14-5-3-13(4-6-14)28-21(33)31-18-10-12(23(25,26)27)2-8-16(18)24/h2-11H,1H3,(H2,28,31,33)(H2,29,30,32,34)
n/an/a 6.90n/an/an/an/a7.422
GSK
Assay Description
The assay uses purified GST-Tie-2 or GST-VEGFR2 interacting with biotinylated peptide substrates. HTRF is based on the proximity of europium cryptate...
J Med Chem 50: 4453-70 (2007)
Article DOI: 10.1021/jm0611051
BindingDB Entry DOI: 10.7270/Q20V8B29
Angiopoietin-1 receptor
(Homo sapiens (Human))
BDBM17789
(benzimidazole-urea, 17 | methyl N-{6-[4-({[2-fluor...)
Show SMILES COC(=O)Nc1nc2ccc(Oc3ccc(NC(=O)Nc4cc(ccc4F)C(F)(F)F)cc3)cc2[nH]1
Show InChI InChI=1S/C23H17F4N5O4/c1-35-22(34)32-20-29-17-9-7-15(11-19(17)30-20)36-14-5-3-13(4-6-14)28-21(33)31-18-10-12(23(25,26)27)2-8-16(18)24/h2-11H,1H3,(H2,28,31,33)(H2,29,30,32,34)
n/an/a 10n/an/an/an/an/an/a
Novartis Research Foundation
Curated by ChEMBL
Assay Description
Inhibition of Tie2 kinase
Nat Chem Biol 2: 358-64 (2006)
Article DOI: 10.1038/nchembio799
BindingDB Entry DOI: 10.7270/Q2CC10WV
RAF proto-oncogene serine/threonine-protein kinase
(Homo sapiens (Human))
BDBM17789
(benzimidazole-urea, 17 | methyl N-{6-[4-({[2-fluor...)
Show SMILES COC(=O)Nc1nc2ccc(Oc3ccc(NC(=O)Nc4cc(ccc4F)C(F)(F)F)cc3)cc2[nH]1
Show InChI InChI=1S/C23H17F4N5O4/c1-35-22(34)32-20-29-17-9-7-15(11-19(17)30-20)36-14-5-3-13(4-6-14)28-21(33)31-18-10-12(23(25,26)27)2-8-16(18)24/h2-11H,1H3,(H2,28,31,33)(H2,29,30,32,34)
NCI pathway
Reactome pathway
n/an/a 695n/an/an/an/an/an/a
Novartis Research Foundation
Curated by ChEMBL
Assay Description
Inhibition of c-Raf kinase
Nat Chem Biol 2: 358-64 (2006)
Article DOI: 10.1038/nchembio799
BindingDB Entry DOI: 10.7270/Q2CC10WV
Vascular endothelial growth factor receptor 2
(Homo sapiens (Human))
BDBM17789
(benzimidazole-urea, 17 | methyl N-{6-[4-({[2-fluor...)
Show SMILES COC(=O)Nc1nc2ccc(Oc3ccc(NC(=O)Nc4cc(ccc4F)C(F)(F)F)cc3)cc2[nH]1
Show InChI InChI=1S/C23H17F4N5O4/c1-35-22(34)32-20-29-17-9-7-15(11-19(17)30-20)36-14-5-3-13(4-6-14)28-21(33)31-18-10-12(23(25,26)27)2-8-16(18)24/h2-11H,1H3,(H2,28,31,33)(H2,29,30,32,34)
NCI pathway
Reactome pathway
n/an/a 3.5n/an/an/an/an/an/a
GSK
Assay Description
The assay uses purified GST-Tie-2 or GST-VEGFR2 interacting with biotinylated peptide substrates. HTRF is based on the proximity of europium cryptate...
J Med Chem 50: 4453-70 (2007)
Article DOI: 10.1021/jm0611051
BindingDB Entry DOI: 10.7270/Q20V8B29
3D
3D Structure (crystal)