BDBM178052 (3,4-Dimethoxyphenyl)[2-(3,4-dimethoxyphenyl)cyclopentyl]methanone (16)
SMILES: COc1ccc(cc1OC)C1CCCC1C(=O)c1ccc(OC)c(OC)c1
InChI Key: InChIKey=CSIXMXZUTGREFZ-UHFFFAOYSA-N
Data: 2 KI  2 IC50
Activity Spreadsheet -- Enzyme Inhibition Constant Data from BindingDB
Found 2 hits for monomerid = 178052
Trg + Lig
Ki
nM
ΔG°
kcal/mole
IC50
nM
Kd
nM
EC50/IC50
nM
koff
s-1
kon
M-1s-1
pHTemp
°C
Carbonic anhydrase 1
(Homo sapiens (Human))
BDBM178052
((3,4-Dimethoxyphenyl)[2-(3,4-dimethoxyphenyl)cyclo...)
Show SMILES COc1ccc(cc1OC)C1CCCC1C(=O)c1ccc(OC)c(OC)c1
Show InChI InChI=1S/C22H26O5/c1-24-18-10-8-14(12-20(18)26-3)16-6-5-7-17(16)22(23)15-9-11-19(25-2)21(13-15)27-4/h8-13,16-17H,5-7H2,1-4H3
NCI pathway
Reactome pathway
610n/a 472n/an/an/an/an/an/a
Atat£rk University
Assay Description
CA isoenzymes activities were determined in according to the method of Verpoorte et al. (76) described previously (77). The increasing in absorbance ...
Chem Biol Drug Des 87: 594-607 (2016)
Article DOI: 10.1111/cbdd.12695
BindingDB Entry DOI: 10.7270/Q20R9N5Q
Carbonic anhydrase 2
(Homo sapiens (Human))
BDBM178052
((3,4-Dimethoxyphenyl)[2-(3,4-dimethoxyphenyl)cyclo...)
Show SMILES COc1ccc(cc1OC)C1CCCC1C(=O)c1ccc(OC)c(OC)c1
Show InChI InChI=1S/C22H26O5/c1-24-18-10-8-14(12-20(18)26-3)16-6-5-7-17(16)22(23)15-9-11-19(25-2)21(13-15)27-4/h8-13,16-17H,5-7H2,1-4H3
Reactome pathway
1.79E+3n/a 656n/an/an/an/an/an/a
Atat£rk University
Assay Description
CA isoenzymes activities were determined in according to the method of Verpoorte et al. (76) described previously (77). The increasing in absorbance ...
Chem Biol Drug Des 87: 594-607 (2016)
Article DOI: 10.1111/cbdd.12695
BindingDB Entry DOI: 10.7270/Q20R9N5Q