BDBM17806 N-{6-[4-({[2-fluoro-5-(trifluoromethyl)phenyl]carbamoyl}amino)phenoxy]-1H-1,3-benzodiazol-2-yl}acetamide::benzimidazole-urea, 46
SMILES: CC(=O)Nc1nc2ccc(Oc3ccc(NC(=O)Nc4cc(ccc4F)C(F)(F)F)cc3)cc2[nH]1
InChI Key: InChIKey=PSQQJYVAJZSKPM-UHFFFAOYSA-N
Data: 2 IC50
Activity Spreadsheet -- Enzyme Inhibition Constant Data from BindingDB
Found 2 hits for monomerid = 17806
Trg + Lig
Ki
nM
ΔG°
kcal/mole
IC50
nM
Kd
nM
EC50/IC50
nM
koff
s-1
kon
M-1s-1
pHTemp
°C
Vascular endothelial growth factor receptor 2
(Homo sapiens (Human))
BDBM17806
(N-{6-[4-({[2-fluoro-5-(trifluoromethyl)phenyl]carb...)
Show SMILES CC(=O)Nc1nc2ccc(Oc3ccc(NC(=O)Nc4cc(ccc4F)C(F)(F)F)cc3)cc2[nH]1
Show InChI InChI=1S/C23H17F4N5O3/c1-12(33)28-21-30-18-9-7-16(11-20(18)31-21)35-15-5-3-14(4-6-15)29-22(34)32-19-10-13(23(25,26)27)2-8-17(19)24/h2-11H,1H3,(H2,29,32,34)(H2,28,30,31,33)
NCI pathway
Reactome pathway
n/an/a 2.60n/an/an/an/an/an/a
GSK
Assay Description
The assay uses purified GST-Tie-2 or GST-VEGFR2 interacting with biotinylated peptide substrates. HTRF is based on the proximity of europium cryptate...
J Med Chem 50: 4453-70 (2007)
Article DOI: 10.1021/jm0611051
BindingDB Entry DOI: 10.7270/Q20V8B29
Angiopoietin-1 receptor
(Homo sapiens (Human))
BDBM17806
(N-{6-[4-({[2-fluoro-5-(trifluoromethyl)phenyl]carb...)
Show SMILES CC(=O)Nc1nc2ccc(Oc3ccc(NC(=O)Nc4cc(ccc4F)C(F)(F)F)cc3)cc2[nH]1
Show InChI InChI=1S/C23H17F4N5O3/c1-12(33)28-21-30-18-9-7-16(11-20(18)31-21)35-15-5-3-14(4-6-15)29-22(34)32-19-10-13(23(25,26)27)2-8-17(19)24/h2-11H,1H3,(H2,29,32,34)(H2,28,30,31,33)
n/an/a 2.60n/an/an/an/a7.422
GSK
Assay Description
The assay uses purified GST-Tie-2 or GST-VEGFR2 interacting with biotinylated peptide substrates. HTRF is based on the proximity of europium cryptate...
J Med Chem 50: 4453-70 (2007)
Article DOI: 10.1021/jm0611051
BindingDB Entry DOI: 10.7270/Q20V8B29