BDBM17813 benzthiazole-urea, 40::methyl N-{6-[4-({[2-fluoro-5-(trifluoromethyl)phenyl]carbamoyl}amino)phenoxy]-1,3-benzothiazol-2-yl}carbamate
SMILES: COC(=O)Nc1nc2ccc(Oc3ccc(NC(=O)Nc4cc(ccc4F)C(F)(F)F)cc3)cc2s1
InChI Key: InChIKey=CLOKCIDZTVIDMJ-UHFFFAOYSA-N
Data: 2 IC50
Activity Spreadsheet -- Enzyme Inhibition Constant Data from BindingDB
Found 2 hits for monomerid = 17813
Trg + Lig
Ki
nM
ΔG°
kcal/mole
IC50
nM
Kd
nM
EC50/IC50
nM
koff
s-1
kon
M-1s-1
pHTemp
°C
Vascular endothelial growth factor receptor 2
(Homo sapiens (Human))
BDBM17813
(benzthiazole-urea, 40 | methyl N-{6-[4-({[2-fluoro...)
Show SMILES COC(=O)Nc1nc2ccc(Oc3ccc(NC(=O)Nc4cc(ccc4F)C(F)(F)F)cc3)cc2s1
Show InChI InChI=1S/C23H16F4N4O4S/c1-34-22(33)31-21-30-17-9-7-15(11-19(17)36-21)35-14-5-3-13(4-6-14)28-20(32)29-18-10-12(23(25,26)27)2-8-16(18)24/h2-11H,1H3,(H2,28,29,32)(H,30,31,33)
NCI pathway
Reactome pathway
n/an/a 2.10n/an/an/an/an/an/a
GSK
Assay Description
The assay uses purified GST-Tie-2 or GST-VEGFR2 interacting with biotinylated peptide substrates. HTRF is based on the proximity of europium cryptate...
J Med Chem 50: 4453-70 (2007)
Article DOI: 10.1021/jm0611051
BindingDB Entry DOI: 10.7270/Q20V8B29
Angiopoietin-1 receptor
(Homo sapiens (Human))
BDBM17813
(benzthiazole-urea, 40 | methyl N-{6-[4-({[2-fluoro...)
Show SMILES COC(=O)Nc1nc2ccc(Oc3ccc(NC(=O)Nc4cc(ccc4F)C(F)(F)F)cc3)cc2s1
Show InChI InChI=1S/C23H16F4N4O4S/c1-34-22(33)31-21-30-17-9-7-15(11-19(17)36-21)35-14-5-3-13(4-6-14)28-20(32)29-18-10-12(23(25,26)27)2-8-16(18)24/h2-11H,1H3,(H2,28,29,32)(H,30,31,33)
n/an/a 6.5n/an/an/an/an/an/a
GSK
Assay Description
The assay uses purified GST-Tie-2 or GST-VEGFR2 interacting with biotinylated peptide substrates. HTRF is based on the proximity of europium cryptate...
J Med Chem 50: 4453-70 (2007)
Article DOI: 10.1021/jm0611051
BindingDB Entry DOI: 10.7270/Q20V8B29