BDBM17815 imidazopyridine-urea,42::methyl N-{6-[4-({[2-fluoro-5-(trifluoromethyl)phenyl]carbamoyl}amino)phenoxy]imidazo[1,2-a]pyridin-2-yl}carbamate
SMILES: COC(=O)Nc1cn2cc(Oc3ccc(NC(=O)Nc4cc(ccc4F)C(F)(F)F)cc3)ccc2n1
InChI Key: InChIKey=XXMJXRZJNGKMJK-UHFFFAOYSA-N
Data: 2 IC50
Activity Spreadsheet -- Enzyme Inhibition Constant Data from BindingDB
Found 2 hits for monomerid = 17815
Trg + Lig
Ki
nM
ΔG°
kcal/mole
IC50
nM
Kd
nM
EC50/IC50
nM
koff
s-1
kon
M-1s-1
pHTemp
°C
Vascular endothelial growth factor receptor 2
(Homo sapiens (Human))
BDBM17815
(imidazopyridine-urea,42 | methyl N-{6-[4-({[2-fluo...)
Show SMILES COC(=O)Nc1cn2cc(Oc3ccc(NC(=O)Nc4cc(ccc4F)C(F)(F)F)cc3)ccc2n1
Show InChI InChI=1S/C23H17F4N5O4/c1-35-22(34)31-19-12-32-11-16(7-9-20(32)30-19)36-15-5-3-14(4-6-15)28-21(33)29-18-10-13(23(25,26)27)2-8-17(18)24/h2-12H,1H3,(H,31,34)(H2,28,29,33)
NCI pathway
Reactome pathway
n/an/a 3.40n/an/an/an/an/an/a
GSK
Assay Description
The assay uses purified GST-Tie-2 or GST-VEGFR2 interacting with biotinylated peptide substrates. HTRF is based on the proximity of europium cryptate...
J Med Chem 50: 4453-70 (2007)
Article DOI: 10.1021/jm0611051
BindingDB Entry DOI: 10.7270/Q20V8B29
Angiopoietin-1 receptor
(Homo sapiens (Human))
BDBM17815
(imidazopyridine-urea,42 | methyl N-{6-[4-({[2-fluo...)
Show SMILES COC(=O)Nc1cn2cc(Oc3ccc(NC(=O)Nc4cc(ccc4F)C(F)(F)F)cc3)ccc2n1
Show InChI InChI=1S/C23H17F4N5O4/c1-35-22(34)31-19-12-32-11-16(7-9-20(32)30-19)36-15-5-3-14(4-6-15)28-21(33)29-18-10-13(23(25,26)27)2-8-17(18)24/h2-12H,1H3,(H,31,34)(H2,28,29,33)
n/an/a 3.40n/an/an/an/an/an/a
GSK
Assay Description
The assay uses purified GST-Tie-2 or GST-VEGFR2 interacting with biotinylated peptide substrates. HTRF is based on the proximity of europium cryptate...
J Med Chem 50: 4453-70 (2007)
Article DOI: 10.1021/jm0611051
BindingDB Entry DOI: 10.7270/Q20V8B29