BDBM178200 US9120808, Example 24
SMILES: OC(=O)C(CC=C)=C1O[C@@H]2CC(=O)N2C1C(=O)OCc1ccccc1
InChI Key: InChIKey=RBWUPNXZJVLGSA-OPGGXJNDSA-N
Data: 3 IC50
Activity Spreadsheet -- Enzyme Inhibition Constant Data from BindingDB
Found 3 hits for monomerid = 178200
Trg + Lig
Ki
nM
ΔG°
kcal/mole
IC50
nM
Kd
nM
EC50/IC50
nM
koff
s-1
kon
M-1s-1
pHTemp
°C
Beta-lactamase
(Escherichia coli)
BDBM178200
(US9120808, Example 24)
Show SMILES OC(=O)C(CC=C)=C1O[C@@H]2CC(=O)N2C1C(=O)OCc1ccccc1 |w:7.15|
Show InChI InChI=1S/C18H17NO6/c1-2-6-12(17(21)22)16-15(19-13(20)9-14(19)25-16)18(23)24-10-11-7-4-3-5-8-11/h2-5,7-8,14-15H,1,6,9-10H2,(H,21,22)/b16-12-/t14-,15?/m1/s1
US Patent
n/an/a 4.98E+3n/an/an/an/a7.037
NABRIVA THERAPEUTICS AG
US Patent
Assay Description
The inhibitory concentrations (IC50, [uM]) of the beta -lactamase inhibitors against purified TEM-1, SHV-1 and AmpC beta -lactamases are assessed by ...
US Patent US9120808 (2015)
BindingDB Entry DOI: 10.7270/Q2Q81BT5
Beta-lactamase TEM
(Escherichia coli)
BDBM178200
(US9120808, Example 24)
Show SMILES OC(=O)C(CC=C)=C1O[C@@H]2CC(=O)N2C1C(=O)OCc1ccccc1 |w:7.15|
Show InChI InChI=1S/C18H17NO6/c1-2-6-12(17(21)22)16-15(19-13(20)9-14(19)25-16)18(23)24-10-11-7-4-3-5-8-11/h2-5,7-8,14-15H,1,6,9-10H2,(H,21,22)/b16-12-/t14-,15?/m1/s1
US Patent
n/an/a 30.6n/an/an/an/a7.037
NABRIVA THERAPEUTICS AG
US Patent
Assay Description
The inhibitory concentrations (IC50, [uM]) of the beta -lactamase inhibitors against purified TEM-1, SHV-1 and AmpC beta -lactamases are assessed by ...
US Patent US9120808 (2015)
BindingDB Entry DOI: 10.7270/Q2Q81BT5
Beta-lactamase SHV-1
(Escherichia coli)
BDBM178200
(US9120808, Example 24)
Show SMILES OC(=O)C(CC=C)=C1O[C@@H]2CC(=O)N2C1C(=O)OCc1ccccc1 |w:7.15|
Show InChI InChI=1S/C18H17NO6/c1-2-6-12(17(21)22)16-15(19-13(20)9-14(19)25-16)18(23)24-10-11-7-4-3-5-8-11/h2-5,7-8,14-15H,1,6,9-10H2,(H,21,22)/b16-12-/t14-,15?/m1/s1
US Patent
n/an/a 62.2n/an/an/an/a7.037
NABRIVA THERAPEUTICS AG
US Patent
Assay Description
The inhibitory concentrations (IC50, [uM]) of the beta -lactamase inhibitors against purified TEM-1, SHV-1 and AmpC beta -lactamases are assessed by ...
US Patent US9120808 (2015)
BindingDB Entry DOI: 10.7270/Q2Q81BT5