BDBM17883 3-{[(1R,5S)-3-{2-[(tert-butylcarbamoyl)amino]-3,3-dimethylbutanoyl}-6,6-dimethyl-3-azabicyclo[3.1.0]hexan-2-yl]formamido}-3-cyclopentyl-2-oxopropanamide::Ketoamide inhibitor, 13
SMILES: CC(C)(C)NC(=O)NC(C(=O)N1C[C@H]2[C@@H](C1C(=O)NC(C1CCCC1)C(=O)C(N)=O)C2(C)C)C(C)(C)C
InChI Key: InChIKey=DXUBZMQVRKNHCE-ACVRPFEBSA-N
Data: 1 KI
Activity Spreadsheet -- Enzyme Inhibition Constant Data from BindingDB
Found 1 hit for monomerid = 17883
Trg + Lig
Ki
nM
ΔG°
kcal/mole
IC50
nM
Kd
nM
EC50/IC50
nM
koff
s-1
kon
M-1s-1
pHTemp
°C
HCV NS3-NS4A Serine Proteinase
(Hepatitis C virus (HCV genotype 1a, isolate H))
BDBM17883
(3-{[(1R,5S)-3-{2-[(tert-butylcarbamoyl)amino]-3,3-...)
Show SMILES CC(C)(C)NC(=O)NC(C(=O)N1C[C@H]2[C@@H](C1C(=O)NC(C1CCCC1)C(=O)C(N)=O)C2(C)C)C(C)(C)C |r|
Show InChI InChI=1S/C27H45N5O5/c1-25(2,3)20(30-24(37)31-26(4,5)6)23(36)32-13-15-16(27(15,7)8)18(32)22(35)29-17(19(33)21(28)34)14-11-9-10-12-14/h14-18,20H,9-13H2,1-8H3,(H2,28,34)(H,29,35)(H2,30,31,37)/t15-,16-,17?,18?,20?/m0/s1
1.80E+3 -7.96n/an/an/an/an/a6.530
Schering-Plough Research Institute
Assay Description
Proteolytic cleavage of the ester linkage between the Nva (L-norvaline) and the chromophore (PAP) was monitored for change in absorbance at 370 nm. I...
J Med Chem 50: 2310-8 (2007)
Article DOI: 10.1021/jm060173k
BindingDB Entry DOI: 10.7270/Q27D2SDK