BDBM179 (4R,5S,6S,7R)-4,7-dibenzyl-5,6-dihydroxy-1,3-bis({3-[1-(hydroxyimino)propyl]phenyl}methyl)-1,3-diazepan-2-one::CHEMBL303128::Cyclic Urea
SMILES: CCC(N=O)c1cccc(CN2[C@H](Cc3ccccc3)[C@H](O)[C@@H](O)[C@@H](Cc3ccccc3)N(Cc3cccc(c3)C(CC)N=O)C2=O)c1
InChI Key: InChIKey=XZYUSIKLNDYKKU-BCJJHTAHSA-N
Data: 2 KI
Activity Spreadsheet -- Enzyme Inhibition Constant Data from BindingDB
Found 2 hits for monomerid = 179
Trg + Lig
Ki
nM
ΔG°
kcal/mole
IC50
nM
Kd
nM
EC50/IC50
nM
koff
s-1
kon
M-1s-1
pHTemp
°C
Human immunodeficiency virus type 1 protease
(Human immunodeficiency virus type 1)
BDBM179
((4R,5S,6S,7R)-4,7-dibenzyl-5,6-dihydroxy-1,3-bis({...)
Show SMILES CCC(N=O)c1cccc(CN2[C@H](Cc3ccccc3)[C@H](O)[C@@H](O)[C@@H](Cc3ccccc3)N(Cc3cccc(c3)C(CC)N=O)C2=O)c1
Show InChI InChI=1S/C39H44N4O5/c1-3-33(40-47)31-19-11-17-29(21-31)25-42-35(23-27-13-7-5-8-14-27)37(44)38(45)36(24-28-15-9-6-10-16-28)43(39(42)46)26-30-18-12-20-32(22-30)34(4-2)41-48/h5-22,33-38,44-45H,3-4,23-26H2,1-2H3/t33?,34?,35-,36-,37+,38+/m1/s1
0.0310n/an/an/an/an/an/an/an/a
The DuPont Merck Pharmaceutical Company
Curated by ChEMBL
Assay Description
Inhibition of HIV protease, measured by assaying the cleavage of a fluorescent peptide substrate using HPLC
J Med Chem 41: 2019-28 (1998)
Article DOI: 10.1021/jm9704199
BindingDB Entry DOI: 10.7270/Q29K49B0
HIV-1 Protease
(Human immunodeficiency virus type 1)
BDBM179
((4R,5S,6S,7R)-4,7-dibenzyl-5,6-dihydroxy-1,3-bis({...)
Show SMILES CCC(N=O)c1cccc(CN2[C@H](Cc3ccccc3)[C@H](O)[C@@H](O)[C@@H](Cc3ccccc3)N(Cc3cccc(c3)C(CC)N=O)C2=O)c1
Show InChI InChI=1S/C39H44N4O5/c1-3-33(40-47)31-19-11-17-29(21-31)25-42-35(23-27-13-7-5-8-14-27)37(44)38(45)36(24-28-15-9-6-10-16-28)43(39(42)46)26-30-18-12-20-32(22-30)34(4-2)41-48/h5-22,33-38,44-45H,3-4,23-26H2,1-2H3/t33?,34?,35-,36-,37+,38+/m1/s1
0.0310 -14.9n/an/an/an/an/a5.537
DuPont Merck Pharmaceutical Company
Assay Description
Ki values were determined with recombinant single-chain dimeric HIV protease and a fluorescent substrate. The use of single-chain dimeric protease a...
J Med Chem 39: 3514-25 (1996)
Article DOI: 10.1021/jm9602571
BindingDB Entry DOI: 10.7270/Q2ZW1J3M