null
SMILES: COc1cc(CC(=O)N2C[C@H](O)[C@H](O)[C@H]2C(=O)N2CCN(CC(O)=O)CC2)ccc1NC(=O)Nc1ccccc1C
InChI Key: InChIKey=WNRYHJYBMLVVMG-MZBJOSPHSA-N
Activity Spreadsheet -- Enzyme Inhibition Constant Data from BindingDB
Found 1 hit for monomerid = 17926
Trg + Lig
Ki
nM
ΔG°
kcal/mole
IC50
nM
Kd
nM
EC50/IC50
nM
koff
s-1
kon
M-1s-1
pHTemp
°C
Integrin alpha-4/beta-1 [T112H]
(Homo sapiens (Human))
BDBM17926
(2-(4-{[(2S,3R,4S)-3,4-dihydroxy-1-[2-(3-methoxy-4-...)
Show SMILES COc1cc(CC(=O)N2C[C@H](O)[C@H](O)[C@H]2C(=O)N2CCN(CC(O)=O)CC2)ccc1NC(=O)Nc1ccccc1C |r|
Show InChI InChI=1S/C28H35N5O8/c1-17-5-3-4-6-19(17)29-28(40)30-20-8-7-18(13-22(20)41-2)14-23(35)33-15-21(34)26(38)25(33)27(39)32-11-9-31(10-12-32)16-24(36)37/h3-8,13,21,25-26,34,38H,9-12,14-16H2,1-2H3,(H,36,37)(H2,29,30,40)/t21-,25-,26-/m0/s1
n/an/a 1.40n/an/an/an/a7.522
Daiichi Pharmaceutical
Assay Description
The 4B4 cells expressing VLA-4 were distributed into each well of a 96-well culture plate for 2 days. Compound and Eu-labeled Human VCAM-1/Fc Chimera...
Bioorg Med Chem 14: 2725-46 (2006)
Article DOI: 10.1016/j.bmc.2005.11.058
BindingDB Entry DOI: 10.7270/Q2ZW1J5H