BDBM179276 US9125915, compound 7
SMILES: COC(=O)C[C@@H]1N=C(c2c(C)c(CO)sc2-n2c(C)nnc12)c1ccc(cc1)-c1ccc(OC)cc1
InChI Key: InChIKey=RILNLUBNEAZMHA-NRFANRHFSA-N
Data: 1 IC50
Activity Spreadsheet -- Enzyme Inhibition Constant Data from BindingDB
Found 1 hit for monomerid = 179276
Trg + Lig
Ki
nM
ΔG°
kcal/mole
IC50
nM
Kd
nM
EC50/IC50
nM
koff
s-1
kon
M-1s-1
pHTemp
°C
H4-BRD4
(Homo sapiens (Human))
BDBM179276
(US9125915, compound 7)
Show SMILES COC(=O)C[C@@H]1N=C(c2c(C)c(CO)sc2-n2c(C)nnc12)c1ccc(cc1)-c1ccc(OC)cc1 |r,c:6|
Show InChI InChI=1S/C27H26N4O4S/c1-15-22(14-32)36-27-24(15)25(28-21(13-23(33)35-4)26-30-29-16(2)31(26)27)19-7-5-17(6-8-19)18-9-11-20(34-3)12-10-18/h5-12,21,32H,13-14H2,1-4H3/t21-/m0/s1
US Patent
n/an/a 113n/an/an/an/an/a25
Mitsubishi Tanabe Pharma Corporation
US Patent
Assay Description
An expression vector containing cDNA of BRD2, 3 and 4 added with Flag-tag was transfected to CHO cell, and a cell lysate was prepared 24 hr later. Bi...
US Patent US9125915 (2015)
BindingDB Entry DOI: 10.7270/Q26972BJ