BDBM179280 US9125915, compound 3
SMILES: CCOC(=O)C[C@@H]1N=C(c2c(C)c(C)sc2-n2c(C)nnc12)c1ccc(Nc2cccnc2)cc1
InChI Key: InChIKey=QTHRZMXZOREJPN-NRFANRHFSA-N
Data: 1 IC50
Activity Spreadsheet -- Enzyme Inhibition Constant Data from BindingDB
Found 1 hit for monomerid = 179280
Trg + Lig
Ki
nM
ΔG°
kcal/mole
IC50
nM
Kd
nM
EC50/IC50
nM
koff
s-1
kon
M-1s-1
pHTemp
°C
H4-BRD4
(Homo sapiens (Human))
BDBM179280
(US9125915, compound 3)
Show SMILES CCOC(=O)C[C@@H]1N=C(c2c(C)c(C)sc2-n2c(C)nnc12)c1ccc(Nc2cccnc2)cc1 |r,c:7|
Show InChI InChI=1S/C26H26N6O2S/c1-5-34-22(33)13-21-25-31-30-17(4)32(25)26-23(15(2)16(3)35-26)24(29-21)18-8-10-19(11-9-18)28-20-7-6-12-27-14-20/h6-12,14,21,28H,5,13H2,1-4H3/t21-/m0/s1
US Patent
n/an/a 54.9n/an/an/an/an/a25
Mitsubishi Tanabe Pharma Corporation
US Patent
Assay Description
An expression vector containing cDNA of BRD2, 3 and 4 added with Flag-tag was transfected to CHO cell, and a cell lysate was prepared 24 hr later. Bi...
US Patent US9125915 (2015)
BindingDB Entry DOI: 10.7270/Q26972BJ