BDBM179392 US9669034, 105 (rac)-[(2,3-Difluoro-5-{[4-(4-fluoro-2-methoxyphenyl)-1,3,5-triazin-2-yl]amino}benzyl)(methyl)oxido-λ6-sulfanylidene]cyanamide
SMILES: COc1cc(F)ccc1-c1ncnc(Nc2cc(F)c(F)c(CS(C)(=O)=NC#N)c2)n1
InChI Key: InChIKey=RINAVKZGXKVFRD-UHFFFAOYSA-N
Data: 2 IC50
Activity Spreadsheet -- Enzyme Inhibition Constant Data from BindingDB
Found 2 hits for monomerid = 179392
Trg + Lig
Ki
nM
ΔG°
kcal/mole
IC50
nM
Kd
nM
EC50/IC50
nM
koff
s-1
kon
M-1s-1
pHTemp
°C
CDK2/CycE
(Homo sapiens (Human))
BDBM179392
(US9669034, 105 (rac)-[(2,3-Difluoro-5-{[4-(4-fluor...)
Show SMILES COc1cc(F)ccc1-c1ncnc(Nc2cc(F)c(F)c(CS(C)(=O)=NC#N)c2)n1
Show InChI InChI=1S/C19H15F3N6O2S/c1-30-16-6-12(20)3-4-14(16)18-24-10-25-19(28-18)27-13-5-11(17(22)15(21)7-13)8-31(2,29)26-9-23/h3-7,10H,8H2,1-2H3,(H,24,25,27,28)
US Patent
n/an/a 140n/an/an/an/a8.022
BAYER INTELLECTUAL PROPERTY GMBH
US Patent
Assay Description
For the assay 50 nl of a 100 fold concentrated solution of the test compound in DMSO was pipetted into a black low volume 384 well microtiter plate (...
US Patent US9669034 (2017)
BindingDB Entry DOI: 10.7270/Q22Z13PG
Cyclin-Dependent Kinase 9 (CDK9)
(Homo sapiens (Human))
BDBM179392
(US9669034, 105 (rac)-[(2,3-Difluoro-5-{[4-(4-fluor...)
Show SMILES COc1cc(F)ccc1-c1ncnc(Nc2cc(F)c(F)c(CS(C)(=O)=NC#N)c2)n1
Show InChI InChI=1S/C19H15F3N6O2S/c1-30-16-6-12(20)3-4-14(16)18-24-10-25-19(28-18)27-13-5-11(17(22)15(21)7-13)8-31(2,29)26-9-23/h3-7,10H,8H2,1-2H3,(H,24,25,27,28)
Reactome pathway
US Patent
n/an/a 3n/an/an/an/a8.022
BAYER INTELLECTUAL PROPERTY GMBH
US Patent
Assay Description
For the assay 50 nl of a 100 fold concentrated solution of the test compound in DMSO was pipetted into a black low volume 384 well microtiter plate (...
US Patent US9669034 (2017)
BindingDB Entry DOI: 10.7270/Q22Z13PG