null
SMILES: CCOC(=O)c1cc([nH]n1)-c1cnc(Oc2ccccc2)nc1
InChI Key: InChIKey=VWFNURQAWMOAPU-UHFFFAOYSA-N
Activity Spreadsheet -- Enzyme Inhibition Constant Data from BindingDB
Found 2 hits for monomerid = 179479
Trg + Lig
Ki
nM
ΔG°
kcal/mole
IC50
nM
Kd
nM
EC50/IC50
nM
koff
s-1
kon
M-1s-1
pHTemp
°C
Hematopoietic prostaglandin D synthase
(Homo sapiens (Human))
BDBM179479
(US9126973, 54)
Show SMILES CCOC(=O)c1cc([nH]n1)-c1cnc(Oc2ccccc2)nc1
Show InChI InChI=1S/C16H14N4O3/c1-2-22-15(21)14-8-13(19-20-14)11-9-17-16(18-10-11)23-12-6-4-3-5-7-12/h3-10H,2H2,1H3,(H,19,20)
Reactome pathway
US Patent
n/an/a 130n/an/an/an/a8.025
CAYMAN CHEMICAL COMPANY, INCORPORATED
US Patent
Assay Description
The assay is carried out by the following steps: 1. Inhibitor screening is performed in 100 mM Tris-HCl, pH 8.0 containing 1 mM GSH, 1 mM MgCl.sub.2,...
US Patent US9126973 (2015)
BindingDB Entry DOI: 10.7270/Q2930RZ3
Hematopoietic prostaglandin D synthase
(Homo sapiens (Human))
BDBM179479
(US9126973, 54)
Show SMILES CCOC(=O)c1cc([nH]n1)-c1cnc(Oc2ccccc2)nc1
Show InChI InChI=1S/C16H14N4O3/c1-2-22-15(21)14-8-13(19-20-14)11-9-17-16(18-10-11)23-12-6-4-3-5-7-12/h3-10H,2H2,1H3,(H,19,20)
Reactome pathway
US Patent
n/an/a 1.30E+3n/an/an/an/an/a25
CAYMAN CHEMICAL COMPANY, INCORPORATED
US Patent
Assay Description
This assay essentially is available from Cayman Chemical Company as Catalog item #600007. The test data reported for the aforementioned Examples (H-P...
US Patent US9126973 (2015)
BindingDB Entry DOI: 10.7270/Q2930RZ3