BDBM179801 3-((2,6-dichloro-3-fluorophenyl)thio)-5-(1-(piperidin-4-yl)-1H-pyrazol-4-yl)-1H-pyrazolo[3,4-b]pyridine (9)
SMILES: Fc1ccc(Cl)c(Sc2n[nH]c3ncc(cc23)-c2cnn(c2)C2CCNCC2)c1Cl
InChI Key: InChIKey=FCLVBOUURHAHBG-UHFFFAOYSA-N
Data: 4 IC50
Activity Spreadsheet -- Enzyme Inhibition Constant Data from BindingDB
Found 4 hits for monomerid = 179801
Trg + Lig
Ki
nM
ΔG°
kcal/mole
IC50
nM
Kd
nM
EC50/IC50
nM
koff
s-1
kon
M-1s-1
pHTemp
°C
Tyrosine kinase receptor c-Met (c-Met)
(Homo sapiens (Human))
BDBM179801
(3-((2,6-dichloro-3-fluorophenyl)thio)-5-(1-(piperi...)
Show SMILES Fc1ccc(Cl)c(Sc2n[nH]c3ncc(cc23)-c2cnn(c2)C2CCNCC2)c1Cl
Show InChI InChI=1S/C20H17Cl2FN6S/c21-15-1-2-16(23)17(22)18(15)30-20-14-7-11(8-25-19(14)27-28-20)12-9-26-29(10-12)13-3-5-24-6-4-13/h1-2,7-10,13,24H,3-6H2,(H,25,27,28)
n/an/a 22.8n/an/an/an/a7.025
Tianjin University of Science and Technology
Assay Description
The c-Met kinase activity of five target compounds and three positive compounds were evaluated using standard Z-LYTE Assays (fluorescence resonance e...
Bioorg Chem 65: 146-58 (2016)
Article DOI: 10.1016/j.bioorg.2016.02.009
BindingDB Entry DOI: 10.7270/Q2VT1QVX
ALK tyrosine kinase receptor (L1196M)
(Homo sapiens (Human))
BDBM179801
(3-((2,6-dichloro-3-fluorophenyl)thio)-5-(1-(piperi...)
Show SMILES Fc1ccc(Cl)c(Sc2n[nH]c3ncc(cc23)-c2cnn(c2)C2CCNCC2)c1Cl
Show InChI InChI=1S/C20H17Cl2FN6S/c21-15-1-2-16(23)17(22)18(15)30-20-14-7-11(8-25-19(14)27-28-20)12-9-26-29(10-12)13-3-5-24-6-4-13/h1-2,7-10,13,24H,3-6H2,(H,25,27,28)
n/an/a 578n/an/an/an/a7.525
Tianjin University of Science and Technology
Assay Description
The ALK kinase activity of five target compounds and three positive compounds were evaluated using standard homogeneous time-resolved fluorescence (H...
Bioorg Chem 65: 146-58 (2016)
Article DOI: 10.1016/j.bioorg.2016.02.009
BindingDB Entry DOI: 10.7270/Q2VT1QVX
Anaplastic lymphoma kinase C1156Y (ALK C1156Y)
(Homo sapiens (Human))
BDBM179801
(3-((2,6-dichloro-3-fluorophenyl)thio)-5-(1-(piperi...)
Show SMILES Fc1ccc(Cl)c(Sc2n[nH]c3ncc(cc23)-c2cnn(c2)C2CCNCC2)c1Cl
Show InChI InChI=1S/C20H17Cl2FN6S/c21-15-1-2-16(23)17(22)18(15)30-20-14-7-11(8-25-19(14)27-28-20)12-9-26-29(10-12)13-3-5-24-6-4-13/h1-2,7-10,13,24H,3-6H2,(H,25,27,28)
n/an/a 651n/an/an/an/a7.525
Tianjin University of Science and Technology
Assay Description
The ALK kinase activity of five target compounds and three positive compounds were evaluated using standard homogeneous time-resolved fluorescence (H...
Bioorg Chem 65: 146-58 (2016)
Article DOI: 10.1016/j.bioorg.2016.02.009
BindingDB Entry DOI: 10.7270/Q2VT1QVX
ALK tyrosine kinase receptor
(Homo sapiens (Human))
BDBM179801
(3-((2,6-dichloro-3-fluorophenyl)thio)-5-(1-(piperi...)
Show SMILES Fc1ccc(Cl)c(Sc2n[nH]c3ncc(cc23)-c2cnn(c2)C2CCNCC2)c1Cl
Show InChI InChI=1S/C20H17Cl2FN6S/c21-15-1-2-16(23)17(22)18(15)30-20-14-7-11(8-25-19(14)27-28-20)12-9-26-29(10-12)13-3-5-24-6-4-13/h1-2,7-10,13,24H,3-6H2,(H,25,27,28)
n/an/a 135n/an/an/an/a7.525
Tianjin University of Science and Technology
Assay Description
The ALK kinase activity of five target compounds and three positive compounds were evaluated using standard homogeneous time-resolved fluorescence (H...
Bioorg Chem 65: 146-58 (2016)
Article DOI: 10.1016/j.bioorg.2016.02.009
BindingDB Entry DOI: 10.7270/Q2VT1QVX