BDBM179838 US9676701, 73 N-(4′-((trans)-2-aminocyclopropyl)biphenyl-2-yl)methanesulfonamide hydrochloride
SMILES: CS(=O)(=O)Nc1ccccc1-c1ccc(cc1)[C@H]1C[C@@H]1N
InChI Key: InChIKey=YPCBVPSZPYSRMW-CABCVRRESA-N
Data: 3 KI
Activity Spreadsheet -- Enzyme Inhibition Constant Data from BindingDB
Found 3 hits for monomerid = 179838
Trg + Lig
Ki
nM
ΔG°
kcal/mole
IC50
nM
Kd
nM
EC50/IC50
nM
koff
s-1
kon
M-1s-1
pHTemp
°C
Lysine-specific histone demethylase 1A
(Homo sapiens (Human))
BDBM179838
(US9676701, 73 N-(4′-((trans)-2-aminocyclopro...)
Show SMILES CS(=O)(=O)Nc1ccccc1-c1ccc(cc1)[C@H]1C[C@@H]1N |r|
Show InChI InChI=1S/C16H18N2O2S/c1-21(19,20)18-16-5-3-2-4-13(16)11-6-8-12(9-7-11)14-10-15(14)17/h2-9,14-15,18H,10,17H2,1H3/t14-,15+/m1/s1
Reactome pathway
US Patent
500 -8.59n/an/an/an/an/a7.425
ORYZON GENOMICS, S.A.
US Patent
Assay Description
Briefly, a fixed amount of LSD1 was incubated on ice for 15 minutes, in the absence and/or in the presence of various concentrations of inhibitor (e....
US Patent US9676701 (2017)
BindingDB Entry DOI: 10.7270/Q27P8WJN
Amine oxidase (flavin-containing) A
(Homo sapiens (Human))
BDBM179838
(US9676701, 73 N-(4′-((trans)-2-aminocyclopro...)
Show SMILES CS(=O)(=O)Nc1ccccc1-c1ccc(cc1)[C@H]1C[C@@H]1N |r|
Show InChI InChI=1S/C16H18N2O2S/c1-21(19,20)18-16-5-3-2-4-13(16)11-6-8-12(9-7-11)14-10-15(14)17/h2-9,14-15,18H,10,17H2,1H3/t14-,15+/m1/s1
US Patent
>1.00E+3n/an/an/an/an/an/a7.5n/a
ORYZON GENOMICS, S.A.
US Patent
Assay Description
Assays were conducted in 96-well black plates with clear bottom (Corning) in a final volume of 100 μL. The assay buffer was 100 mM HEPES, pH 7.5...
US Patent US9676701 (2017)
BindingDB Entry DOI: 10.7270/Q27P8WJN
Amine oxidase [flavin-containing] B
(Homo sapiens (Human))
BDBM179838
(US9676701, 73 N-(4′-((trans)-2-aminocyclopro...)
Show SMILES CS(=O)(=O)Nc1ccccc1-c1ccc(cc1)[C@H]1C[C@@H]1N |r|
Show InChI InChI=1S/C16H18N2O2S/c1-21(19,20)18-16-5-3-2-4-13(16)11-6-8-12(9-7-11)14-10-15(14)17/h2-9,14-15,18H,10,17H2,1H3/t14-,15+/m1/s1
US Patent
>1.00E+3n/an/an/an/an/an/a7.5n/a
ORYZON GENOMICS, S.A.
US Patent
Assay Description
Assays were conducted in 96-well black plates with clear bottom (Corning) in a final volume of 100 μL. The assay buffer was 100 mM HEPES, pH 7.5...
US Patent US9676701 (2017)
BindingDB Entry DOI: 10.7270/Q27P8WJN