BDBM179839 US9676701, 74 4′-((trans)-2-aminocyclopropyl)-6-methoxybiphenyl-3-carbonitrile hydrochloride
SMILES: COc1ccc(cc1-c1ccc(cc1)[C@H]1C[C@@H]1N)C#N
InChI Key: InChIKey=OCQWIYBRDBYXAY-ZBFHGGJFSA-N
Data: 3 KI
Activity Spreadsheet -- Enzyme Inhibition Constant Data from BindingDB
Found 3 hits for monomerid = 179839
Trg + Lig
Ki
nM
ΔG°
kcal/mole
IC50
nM
Kd
nM
EC50/IC50
nM
koff
s-1
kon
M-1s-1
pHTemp
°C
Lysine-specific histone demethylase 1A
(Homo sapiens (Human))
BDBM179839
(US9676701, 74 4′-((trans)-2-aminocyclopropyl...)
Show SMILES COc1ccc(cc1-c1ccc(cc1)[C@H]1C[C@@H]1N)C#N |r|
Show InChI InChI=1S/C17H16N2O/c1-20-17-7-2-11(10-18)8-15(17)13-5-3-12(4-6-13)14-9-16(14)19/h2-8,14,16H,9,19H2,1H3/t14-,16+/m1/s1
Reactome pathway
US Patent
500 -8.59n/an/an/an/an/a7.425
ORYZON GENOMICS, S.A.
US Patent
Assay Description
Briefly, a fixed amount of LSD1 was incubated on ice for 15 minutes, in the absence and/or in the presence of various concentrations of inhibitor (e....
US Patent US9676701 (2017)
BindingDB Entry DOI: 10.7270/Q27P8WJN
Amine oxidase (flavin-containing) A
(Homo sapiens (Human))
BDBM179839
(US9676701, 74 4′-((trans)-2-aminocyclopropyl...)
Show SMILES COc1ccc(cc1-c1ccc(cc1)[C@H]1C[C@@H]1N)C#N |r|
Show InChI InChI=1S/C17H16N2O/c1-20-17-7-2-11(10-18)8-15(17)13-5-3-12(4-6-13)14-9-16(14)19/h2-8,14,16H,9,19H2,1H3/t14-,16+/m1/s1
US Patent
>1.00E+3n/an/an/an/an/an/a7.5n/a
ORYZON GENOMICS, S.A.
US Patent
Assay Description
Assays were conducted in 96-well black plates with clear bottom (Corning) in a final volume of 100 μL. The assay buffer was 100 mM HEPES, pH 7.5...
US Patent US9676701 (2017)
BindingDB Entry DOI: 10.7270/Q27P8WJN
Amine oxidase [flavin-containing] B
(Homo sapiens (Human))
BDBM179839
(US9676701, 74 4′-((trans)-2-aminocyclopropyl...)
Show SMILES COc1ccc(cc1-c1ccc(cc1)[C@H]1C[C@@H]1N)C#N |r|
Show InChI InChI=1S/C17H16N2O/c1-20-17-7-2-11(10-18)8-15(17)13-5-3-12(4-6-13)14-9-16(14)19/h2-8,14,16H,9,19H2,1H3/t14-,16+/m1/s1
US Patent
>1.00E+3n/an/an/an/an/an/a7.5n/a
ORYZON GENOMICS, S.A.
US Patent
Assay Description
Assays were conducted in 96-well black plates with clear bottom (Corning) in a final volume of 100 μL. The assay buffer was 100 mM HEPES, pH 7.5...
US Patent US9676701 (2017)
BindingDB Entry DOI: 10.7270/Q27P8WJN