BDBM17988 1,4-benzoxazin-3-one, 25::6-(2,4-diamino-6-ethylpyrimidin-5-yl)-2-(3,5-difluorophenyl)-4-(3-methoxypropyl)-2-methyl-3,4-dihydro-2H-1,4-benzoxazin-3-one::diaminopyrimidine renin inhibitor compound, 7
SMILES: CCc1nc(N)nc(N)c1-c1ccc2OC(C)(C(=O)N(CCCOC)c2c1)c1cc(F)cc(F)c1
InChI Key: InChIKey=UAXNNGUDPWZOKX-UHFFFAOYSA-N
Data: 2 IC50  1 ITC
PDB links: 1 PDB ID matches this monomer.
Activity Spreadsheet -- Enzyme Inhibition Constant Data from BindingDB
Found 2 hits for monomerid = 17988
Trg + Lig
Ki
nM
ΔG°
kcal/mole
IC50
nM
Kd
nM
EC50/IC50
nM
koff
s-1
kon
M-1s-1
pHTemp
°C
Renin
(Homo sapiens (Human))
BDBM17988
(1,4-benzoxazin-3-one, 25 | 6-(2,4-diamino-6-ethylp...)
Show SMILES CCc1nc(N)nc(N)c1-c1ccc2OC(C)(C(=O)N(CCCOC)c2c1)c1cc(F)cc(F)c1
Show InChI InChI=1S/C25H27F2N5O3/c1-4-18-21(22(28)31-24(29)30-18)14-6-7-20-19(10-14)32(8-5-9-34-3)23(33)25(2,35-20)15-11-16(26)13-17(27)12-15/h6-7,10-13H,4-5,8-9H2,1-3H3,(H4,28,29,30,31)
Reactome pathway
n/an/a 7.10n/an/an/an/a7.422
Pfizer
Assay Description
The renin assay utilized a tandem Green Flourescent Protein (tGFP) substrate that was hydrolyzed by human rennin. The tGFP substrate contained a nine...
Anal Biochem 360: 30-40 (2007)
Article DOI: 10.1016/j.ab.2006.10.017
BindingDB Entry DOI: 10.7270/Q22N50HD
3D
3D Structure (crystal)
Renin
(Homo sapiens (Human))
BDBM17988
(1,4-benzoxazin-3-one, 25 | 6-(2,4-diamino-6-ethylp...)
Show SMILES CCc1nc(N)nc(N)c1-c1ccc2OC(C)(C(=O)N(CCCOC)c2c1)c1cc(F)cc(F)c1
Show InChI InChI=1S/C25H27F2N5O3/c1-4-18-21(22(28)31-24(29)30-18)14-6-7-20-19(10-14)32(8-5-9-34-3)23(33)25(2,35-20)15-11-16(26)13-17(27)12-15/h6-7,10-13H,4-5,8-9H2,1-3H3,(H4,28,29,30,31)
Reactome pathway
n/an/a 7n/an/an/an/a7.422
Pfizer
Assay Description
The renin assay utilized a tandem Green Flourescent Protein (tGFP) substrate that was hydrolyzed by human rennin. The tGFP substrate contained a nine...
Bioorg Med Chem 15: 5912-49 (2007)
Article DOI: 10.1016/j.bmc.2007.05.069
BindingDB Entry DOI: 10.7270/Q2FX77QX
3D
3D Structure (crystal)
Activity Spreadsheet -- ITC Data from BindingDB
Found 1 hit for monomerid = 17988
Cell (A)Syringe (B)Cell
Syringe
Cell + Syr
ΔG°
kcal/mole
-TΔS°
kcal/mole
ΔH°
kcal/mole
log KpHTemp
°C
BDBM17988
JPEG
(1,4-benzoxazin-3-one, 25 | 6-(2,4-diamino-6-ethylp...)
Renin
(Homo sapiens (Human))
-9.25-0.367-8.896.73728
Pfizer
Anal Biochem 360: 30-40 (2007)