BDBM179902 US10231963, Table C.6::US10287250, Compound D.6::US10736890, Compound TABLE C.6::US10752592, Compound TABLE D.6::US9133125, Table D, Compound 6::US9656961, Example 00170
SMILES: NC(=O)c1ccc2C[C@@H]3C4CCCC[C@]4(CCN3CC3CCC3)c2c1
InChI Key: InChIKey=GIZYPGRXWUVSHP-KXBOQVSUSA-N
Data: 6 KI  6 IC50  5 EC50
Activity Spreadsheet -- Enzyme Inhibition Constant Data from BindingDB
Found 16 hits for monomerid = 179902
Trg + Lig
Ki
nM
ΔG°
kcal/mole
IC50
nM
Kd
nM
EC50/IC50
nM
koff
s-1
kon
M-1s-1
pHTemp
°C
Mu-type opioid receptor
(Homo sapiens (Human))
BDBM179902
(US10231963, Table C.6 | US10287250, Compound D.6 |...)
Show SMILES NC(=O)c1ccc2C[C@@H]3C4CCCC[C@]4(CCN3CC3CCC3)c2c1 |r|
Show InChI InChI=1S/C22H30N2O/c23-21(25)17-8-7-16-13-20-18-6-1-2-9-22(18,19(16)12-17)10-11-24(20)14-15-4-3-5-15/h7-8,12,15,18,20H,1-6,9-11,13-14H2,(H2,23,25)/t18?,20-,22-/m1/s1
NCI pathway
Reactome pathway
US Patent
0.0980n/an/an/an/an/an/an/an/a
Universita degli Studi di Bari
Assay Description
The Ki (binding affinity) for opioid receptors was determined using a competitive displacement assay as previously described in Neumeyer (Journal of ...
J Med Chem 50: 4214-21 (2007)
BindingDB Entry DOI: 10.7270/Q2W66P26
Mu-type opioid receptor
(Homo sapiens (Human))
BDBM179902
(US10231963, Table C.6 | US10287250, Compound D.6 |...)
Show SMILES NC(=O)c1ccc2C[C@@H]3C4CCCC[C@]4(CCN3CC3CCC3)c2c1 |r|
Show InChI InChI=1S/C22H30N2O/c23-21(25)17-8-7-16-13-20-18-6-1-2-9-22(18,19(16)12-17)10-11-24(20)14-15-4-3-5-15/h7-8,12,15,18,20H,1-6,9-11,13-14H2,(H2,23,25)/t18?,20-,22-/m1/s1
NCI pathway
Reactome pathway
US Patent
0.0980n/an/an/an/an/an/an/an/a
ALKERMES PHARMA IRELAND LIMITED
US Patent
Assay Description
The Ki (binding affinity) for μ opioid receptors was determined using a competitive displacement assay as previously described in Neumeyer (Jour...
US Patent US10752592 (2020)
Mu-type opioid receptor
(Homo sapiens (Human))
BDBM179902
(US10231963, Table C.6 | US10287250, Compound D.6 |...)
Show SMILES NC(=O)c1ccc2C[C@@H]3C4CCCC[C@]4(CCN3CC3CCC3)c2c1 |r|
Show InChI InChI=1S/C22H30N2O/c23-21(25)17-8-7-16-13-20-18-6-1-2-9-22(18,19(16)12-17)10-11-24(20)14-15-4-3-5-15/h7-8,12,15,18,20H,1-6,9-11,13-14H2,(H2,23,25)/t18?,20-,22-/m1/s1
NCI pathway
Reactome pathway
US Patent
0.0980n/an/an/an/an/an/an/an/a
ALKERMES PHARMA IRELAND LIMITED
US Patent
Assay Description
The Ki (binding affinity) for μ opioid receptors was determined using a competitive displacement assay as previously described in Neumeyer (Jour...
US Patent US10736890 (2020)
Mu-type opioid receptor
(Homo sapiens (Human))
BDBM179902
(US10231963, Table C.6 | US10287250, Compound D.6 |...)
Show SMILES NC(=O)c1ccc2C[C@@H]3C4CCCC[C@]4(CCN3CC3CCC3)c2c1 |r|
Show InChI InChI=1S/C22H30N2O/c23-21(25)17-8-7-16-13-20-18-6-1-2-9-22(18,19(16)12-17)10-11-24(20)14-15-4-3-5-15/h7-8,12,15,18,20H,1-6,9-11,13-14H2,(H2,23,25)/t18?,20-,22-/m1/s1
NCI pathway
Reactome pathway
US Patent
0.0980n/an/an/an/an/an/an/an/a
ALKERMES PHARMA IRELAND LIMITED
US Patent
Assay Description
The Ki (binding affinity) for opioid receptors was determined using a competitive displacement assay as previously described in Neumeyer (Journal of ...
US Patent US9656961 (2017)
BindingDB Entry DOI: 10.7270/Q2PR7Z13
Mu-type opioid receptor
(Homo sapiens (Human))
BDBM179902
(US10231963, Table C.6 | US10287250, Compound D.6 |...)
Show SMILES NC(=O)c1ccc2C[C@@H]3C4CCCC[C@]4(CCN3CC3CCC3)c2c1 |r|
Show InChI InChI=1S/C22H30N2O/c23-21(25)17-8-7-16-13-20-18-6-1-2-9-22(18,19(16)12-17)10-11-24(20)14-15-4-3-5-15/h7-8,12,15,18,20H,1-6,9-11,13-14H2,(H2,23,25)/t18?,20-,22-/m1/s1
NCI pathway
Reactome pathway
US Patent
0.0980 -13.6 7.80n/an/an/an/a7.525
ALKERMES PHARMA IRELAND LIMITED
US Patent
Assay Description
The Ki (binding affinity) for u opioid receptors was determined using a competitive displacement assay as previously described in Neumeyer (Journal o...
US Patent US9133125 (2015)
BindingDB Entry DOI: 10.7270/Q2736PPB
Mu-type opioid receptor
(Homo sapiens (Human))
BDBM179902
(US10231963, Table C.6 | US10287250, Compound D.6 |...)
Show SMILES NC(=O)c1ccc2C[C@@H]3C4CCCC[C@]4(CCN3CC3CCC3)c2c1 |r|
Show InChI InChI=1S/C22H30N2O/c23-21(25)17-8-7-16-13-20-18-6-1-2-9-22(18,19(16)12-17)10-11-24(20)14-15-4-3-5-15/h7-8,12,15,18,20H,1-6,9-11,13-14H2,(H2,23,25)/t18?,20-,22-/m1/s1
NCI pathway
Reactome pathway
US Patent
0.0980n/an/an/an/an/an/an/an/a
Bristol-Myers Squibb Company
Assay Description
The Ki (binding affinity) for μ opioid receptors was determined using a competitive displacement assay as previously described in Neumeyer (Jour...
Bioorg Med Chem Lett 17: 4284-9 (2007)
BindingDB Entry DOI: 10.7270/Q2125W08
Mu-type opioid receptor
(Homo sapiens (Human))
BDBM179902
(US10231963, Table C.6 | US10287250, Compound D.6 |...)
Show SMILES NC(=O)c1ccc2C[C@@H]3C4CCCC[C@]4(CCN3CC3CCC3)c2c1 |r|
Show InChI InChI=1S/C22H30N2O/c23-21(25)17-8-7-16-13-20-18-6-1-2-9-22(18,19(16)12-17)10-11-24(20)14-15-4-3-5-15/h7-8,12,15,18,20H,1-6,9-11,13-14H2,(H2,23,25)/t18?,20-,22-/m1/s1
NCI pathway
Reactome pathway
US Patent
n/an/a 7.80n/an/an/an/an/an/a
Universita degli Studi di Bari
Assay Description
The Ki (binding affinity) for opioid receptors was determined using a competitive displacement assay as previously described in Neumeyer (Journal of ...
J Med Chem 50: 4214-21 (2007)
BindingDB Entry DOI: 10.7270/Q2W66P26
Mu-type opioid receptor
(Homo sapiens (Human))
BDBM179902
(US10231963, Table C.6 | US10287250, Compound D.6 |...)
Show SMILES NC(=O)c1ccc2C[C@@H]3C4CCCC[C@]4(CCN3CC3CCC3)c2c1 |r|
Show InChI InChI=1S/C22H30N2O/c23-21(25)17-8-7-16-13-20-18-6-1-2-9-22(18,19(16)12-17)10-11-24(20)14-15-4-3-5-15/h7-8,12,15,18,20H,1-6,9-11,13-14H2,(H2,23,25)/t18?,20-,22-/m1/s1
NCI pathway
Reactome pathway
US Patent
n/an/a 7.80n/an/an/an/an/an/a
ALKERMES PHARMA IRELAND LIMITED
US Patent
Assay Description
The Ki (binding affinity) for μ opioid receptors was determined using a competitive displacement assay as previously described in Neumeyer (Jour...
US Patent US10736890 (2020)
Mu-type opioid receptor
(Homo sapiens (Human))
BDBM179902
(US10231963, Table C.6 | US10287250, Compound D.6 |...)
Show SMILES NC(=O)c1ccc2C[C@@H]3C4CCCC[C@]4(CCN3CC3CCC3)c2c1 |r|
Show InChI InChI=1S/C22H30N2O/c23-21(25)17-8-7-16-13-20-18-6-1-2-9-22(18,19(16)12-17)10-11-24(20)14-15-4-3-5-15/h7-8,12,15,18,20H,1-6,9-11,13-14H2,(H2,23,25)/t18?,20-,22-/m1/s1
NCI pathway
Reactome pathway
US Patent
n/an/an/an/a 2.5n/an/an/an/a
ALKERMES PHARMA IRELAND LIMITED
US Patent
Assay Description
The Ki (binding affinity) for μ opioid receptors was determined using a competitive displacement assay as previously described in Neumeyer (Jour...
US Patent US10752592 (2020)
Mu-type opioid receptor
(Homo sapiens (Human))
BDBM179902
(US10231963, Table C.6 | US10287250, Compound D.6 |...)
Show SMILES NC(=O)c1ccc2C[C@@H]3C4CCCC[C@]4(CCN3CC3CCC3)c2c1 |r|
Show InChI InChI=1S/C22H30N2O/c23-21(25)17-8-7-16-13-20-18-6-1-2-9-22(18,19(16)12-17)10-11-24(20)14-15-4-3-5-15/h7-8,12,15,18,20H,1-6,9-11,13-14H2,(H2,23,25)/t18?,20-,22-/m1/s1
NCI pathway
Reactome pathway
US Patent
n/an/an/an/a 2.5n/an/an/an/a
Universita degli Studi di Bari
Assay Description
The Ki (binding affinity) for opioid receptors was determined using a competitive displacement assay as previously described in Neumeyer (Journal of ...
J Med Chem 50: 4214-21 (2007)
BindingDB Entry DOI: 10.7270/Q2W66P26
Mu-type opioid receptor
(Homo sapiens (Human))
BDBM179902
(US10231963, Table C.6 | US10287250, Compound D.6 |...)
Show SMILES NC(=O)c1ccc2C[C@@H]3C4CCCC[C@]4(CCN3CC3CCC3)c2c1 |r|
Show InChI InChI=1S/C22H30N2O/c23-21(25)17-8-7-16-13-20-18-6-1-2-9-22(18,19(16)12-17)10-11-24(20)14-15-4-3-5-15/h7-8,12,15,18,20H,1-6,9-11,13-14H2,(H2,23,25)/t18?,20-,22-/m1/s1
NCI pathway
Reactome pathway
US Patent
n/an/a 7.80n/an/an/an/an/an/a
Bristol-Myers Squibb Company
Assay Description
The Ki (binding affinity) for μ opioid receptors was determined using a competitive displacement assay as previously described in Neumeyer (Jour...
Bioorg Med Chem Lett 17: 4284-9 (2007)
BindingDB Entry DOI: 10.7270/Q2125W08
Mu-type opioid receptor
(Homo sapiens (Human))
BDBM179902
(US10231963, Table C.6 | US10287250, Compound D.6 |...)
Show SMILES NC(=O)c1ccc2C[C@@H]3C4CCCC[C@]4(CCN3CC3CCC3)c2c1 |r|
Show InChI InChI=1S/C22H30N2O/c23-21(25)17-8-7-16-13-20-18-6-1-2-9-22(18,19(16)12-17)10-11-24(20)14-15-4-3-5-15/h7-8,12,15,18,20H,1-6,9-11,13-14H2,(H2,23,25)/t18?,20-,22-/m1/s1
NCI pathway
Reactome pathway
US Patent
n/an/an/an/a 2.5n/an/an/an/a
Bristol-Myers Squibb Company
Assay Description
The EC50 and Imax for μ opioid receptors was determined using a [35S]GTPγS binding assay. This assay measures the functional properties of ...
Bioorg Med Chem Lett 17: 4284-9 (2007)
BindingDB Entry DOI: 10.7270/Q2125W08
Mu-type opioid receptor
(Homo sapiens (Human))
BDBM179902
(US10231963, Table C.6 | US10287250, Compound D.6 |...)
Show SMILES NC(=O)c1ccc2C[C@@H]3C4CCCC[C@]4(CCN3CC3CCC3)c2c1 |r|
Show InChI InChI=1S/C22H30N2O/c23-21(25)17-8-7-16-13-20-18-6-1-2-9-22(18,19(16)12-17)10-11-24(20)14-15-4-3-5-15/h7-8,12,15,18,20H,1-6,9-11,13-14H2,(H2,23,25)/t18?,20-,22-/m1/s1
NCI pathway
Reactome pathway
US Patent
n/an/a 7.80n/an/an/an/an/an/a
ALKERMES PHARMA IRELAND LIMITED
US Patent
Assay Description
The Ki (binding affinity) for opioid receptors was determined using a competitive displacement assay as previously described in Neumeyer (Journal of ...
US Patent US9656961 (2017)
BindingDB Entry DOI: 10.7270/Q2PR7Z13
Mu-type opioid receptor
(Homo sapiens (Human))
BDBM179902
(US10231963, Table C.6 | US10287250, Compound D.6 |...)
Show SMILES NC(=O)c1ccc2C[C@@H]3C4CCCC[C@]4(CCN3CC3CCC3)c2c1 |r|
Show InChI InChI=1S/C22H30N2O/c23-21(25)17-8-7-16-13-20-18-6-1-2-9-22(18,19(16)12-17)10-11-24(20)14-15-4-3-5-15/h7-8,12,15,18,20H,1-6,9-11,13-14H2,(H2,23,25)/t18?,20-,22-/m1/s1
NCI pathway
Reactome pathway
US Patent
n/an/an/an/a 2.5n/an/an/an/a
ALKERMES PHARMA IRELAND LIMITED
US Patent
Assay Description
The Ki (binding affinity) for opioid receptors was determined using a competitive displacement assay as previously described in Neumeyer (Journal of ...
US Patent US9656961 (2017)
BindingDB Entry DOI: 10.7270/Q2PR7Z13
Mu-type opioid receptor
(Homo sapiens (Human))
BDBM179902
(US10231963, Table C.6 | US10287250, Compound D.6 |...)
Show SMILES NC(=O)c1ccc2C[C@@H]3C4CCCC[C@]4(CCN3CC3CCC3)c2c1 |r|
Show InChI InChI=1S/C22H30N2O/c23-21(25)17-8-7-16-13-20-18-6-1-2-9-22(18,19(16)12-17)10-11-24(20)14-15-4-3-5-15/h7-8,12,15,18,20H,1-6,9-11,13-14H2,(H2,23,25)/t18?,20-,22-/m1/s1
NCI pathway
Reactome pathway
US Patent
n/an/a 7.80n/an/an/an/an/an/a
ALKERMES PHARMA IRELAND LIMITED
US Patent
Assay Description
The Ki (binding affinity) for μ opioid receptors was determined using a competitive displacement assay as previously described in Neumeyer (Jour...
US Patent US10752592 (2020)
Mu-type opioid receptor
(Homo sapiens (Human))
BDBM179902
(US10231963, Table C.6 | US10287250, Compound D.6 |...)
Show SMILES NC(=O)c1ccc2C[C@@H]3C4CCCC[C@]4(CCN3CC3CCC3)c2c1 |r|
Show InChI InChI=1S/C22H30N2O/c23-21(25)17-8-7-16-13-20-18-6-1-2-9-22(18,19(16)12-17)10-11-24(20)14-15-4-3-5-15/h7-8,12,15,18,20H,1-6,9-11,13-14H2,(H2,23,25)/t18?,20-,22-/m1/s1
NCI pathway
Reactome pathway
US Patent
n/an/an/an/a 2.5n/an/a7.4n/a
ALKERMES PHARMA IRELAND LIMITED
US Patent
Assay Description
The EC50 and Imax for μ opioid receptors was determined using a [I35S]GTPγS binding assay. This assay measures the functional properties of a compo...
US Patent US9133125 (2015)
BindingDB Entry DOI: 10.7270/Q2736PPB