BDBM180002 US9676720, Example 16
SMILES: CC#Cc1cccc(c1)-c1ccc(CN(Cc2cccc(NCC(O)=O)n2)S(=O)(=O)c2ccccc2)cc1
InChI Key: InChIKey=FEGCHTUTFJLCIS-UHFFFAOYSA-N
Data: 1 KI
Activity Spreadsheet -- Enzyme Inhibition Constant Data from BindingDB
Found 1 hit for monomerid = 180002
Trg + Lig
Ki
nM
ΔG°
kcal/mole
IC50
nM
Kd
nM
EC50/IC50
nM
koff
s-1
kon
M-1s-1
pHTemp
°C
Prostaglandin E2 receptor EP2 subtype
(Homo sapiens (Human))
BDBM180002
(US9676720, Example 16)
Show SMILES CC#Cc1cccc(c1)-c1ccc(CN(Cc2cccc(NCC(O)=O)n2)S(=O)(=O)c2ccccc2)cc1
Show InChI InChI=1S/C30H27N3O4S/c1-2-8-23-9-6-10-26(19-23)25-17-15-24(16-18-25)21-33(38(36,37)28-12-4-3-5-13-28)22-27-11-7-14-29(32-27)31-20-30(34)35/h3-7,9-19H,20-22H2,1H3,(H,31,32)(H,34,35)
Reactome pathway
US Patent
0.950n/an/an/an/an/an/a6.0n/a
UBE INDUSTRIES, LTD.
US Patent
Assay Description
Measurement of EP2 receptor binding action was performed in accordance with the method of Abramovitz et al. (Biochimica et Biophysica Acta, 1483, 285...
US Patent US9676720 (2017)
BindingDB Entry DOI: 10.7270/Q2057D39