BDBM180009 US9676720, Comparative example 5
SMILES: Cc1cnc(s1)-c1ccc(CN(Cc2cccc(NCC(O)=O)n2)S(=O)(=O)c2ccccn2)cc1
InChI Key: InChIKey=NTMMFLJCCHOWJF-UHFFFAOYSA-N
Data: 1 KI
Activity Spreadsheet -- Enzyme Inhibition Constant Data from BindingDB
Found 1 hit for monomerid = 180009
Trg + Lig
Ki
nM
ΔG°
kcal/mole
IC50
nM
Kd
nM
EC50/IC50
nM
koff
s-1
kon
M-1s-1
pHTemp
°C
Prostaglandin E2 receptor EP2 subtype
(Homo sapiens (Human))
BDBM180009
(US9676720, Comparative example 5)
Show SMILES Cc1cnc(s1)-c1ccc(CN(Cc2cccc(NCC(O)=O)n2)S(=O)(=O)c2ccccn2)cc1
Show InChI InChI=1S/C24H23N5O4S2/c1-17-13-27-24(34-17)19-10-8-18(9-11-19)15-29(35(32,33)22-7-2-3-12-25-22)16-20-5-4-6-21(28-20)26-14-23(30)31/h2-13H,14-16H2,1H3,(H,26,28)(H,30,31)
Reactome pathway
US Patent
>10n/an/an/an/an/an/a6.0n/a
UBE INDUSTRIES, LTD.
US Patent
Assay Description
Measurement of EP2 receptor binding action was performed in accordance with the method of Abramovitz et al. (Biochimica et Biophysica Acta, 1483, 285...
US Patent US9676720 (2017)
BindingDB Entry DOI: 10.7270/Q2057D39