BDBM180024 US9676720, Comparative example 11
SMILES: COc1cccc(c1)-c1ccc(CN(Cc2cccc(NCC(O)=O)n2)S(=O)(=O)c2ccccn2)cc1
InChI Key: InChIKey=VNMHAOCAJCMJRG-UHFFFAOYSA-N
Data: 1 KI
Activity Spreadsheet -- Enzyme Inhibition Constant Data from BindingDB
Found 1 hit for monomerid = 180024
Trg + Lig
Ki
nM
ΔG°
kcal/mole
IC50
nM
Kd
nM
EC50/IC50
nM
koff
s-1
kon
M-1s-1
pHTemp
°C
Prostaglandin E2 receptor EP2 subtype
(Homo sapiens (Human))
BDBM180024
(US9676720, Comparative example 11)
Show SMILES COc1cccc(c1)-c1ccc(CN(Cc2cccc(NCC(O)=O)n2)S(=O)(=O)c2ccccn2)cc1
Show InChI InChI=1S/C27H26N4O5S/c1-36-24-8-4-6-22(16-24)21-13-11-20(12-14-21)18-31(37(34,35)26-10-2-3-15-28-26)19-23-7-5-9-25(30-23)29-17-27(32)33/h2-16H,17-19H2,1H3,(H,29,30)(H,32,33)
Reactome pathway
US Patent
1.20n/an/an/an/an/an/a6.0n/a
UBE INDUSTRIES, LTD.
US Patent
Assay Description
Measurement of EP2 receptor binding action was performed in accordance with the method of Abramovitz et al. (Biochimica et Biophysica Acta, 1483, 285...
US Patent US9676720 (2017)
BindingDB Entry DOI: 10.7270/Q2057D39