null
SMILES: COC(=O)N[C@@H](C(c1ccccc1)c1ccccc1)C(=O)N[C@H](c1ccc(s1)[C@@H](CO)N(C(C)C)S(=O)(=O)c1ccc(CO)cc1)C(F)(F)F
InChI Key: InChIKey=JENDYNQVPBLXRL-RKVVATLDSA-N
Activity Spreadsheet -- Enzyme Inhibition Constant Data from BindingDB
Found 1 hit for monomerid = 180183
Trg + Lig
Ki
nM
ΔG°
kcal/mole
IC50
nM
Kd
nM
EC50/IC50
nM
koff
s-1
kon
M-1s-1
pHTemp
°C
Gag-Pol polyprotein
(Human immunodeficiency virus type 1 group M subtyp...)
BDBM180183
(US9133157, 65)
Show SMILES COC(=O)N[C@@H](C(c1ccccc1)c1ccccc1)C(=O)N[C@H](c1ccc(s1)[C@@H](CO)N(C(C)C)S(=O)(=O)c1ccc(CO)cc1)C(F)(F)F |r|
Show InChI InChI=1S/C35H38F3N3O7S2/c1-22(2)41(50(46,47)26-16-14-23(20-42)15-17-26)27(21-43)28-18-19-29(49-28)32(35(36,37)38)40-33(44)31(39-34(45)48-3)30(24-10-6-4-7-11-24)25-12-8-5-9-13-25/h4-19,22,27,30-32,42-43H,20-21H2,1-3H3,(H,39,45)(H,40,44)/t27-,31+,32-/m1/s1
US Patent
n/an/a 0.180n/an/an/an/a5.525
Merck Canada Inc.
US Patent
Assay Description
The inhibition of WT HIV-1 protease was studied using the reaction of the protease (expressed in Eschericia coli) with a peptide substrate [Val-Ser-G...
US Patent US9133157 (2015)
BindingDB Entry DOI: 10.7270/Q2Q52NDV