null
SMILES: COc1cccc(c1)S(=O)(=O)c1ccc(CNC(Nc2ccncc2)=NC#N)cc1
InChI Key: InChIKey=VUXIWQNSGBDGKP-UHFFFAOYSA-N
Activity Spreadsheet -- Enzyme Inhibition Constant Data from BindingDB
Found 1 hit for monomerid = 180272
Trg + Lig
Ki
nM
ΔG°
kcal/mole
IC50
nM
Kd
nM
EC50/IC50
nM
koff
s-1
kon
M-1s-1
pHTemp
°C
Nicotinamide phosphoribosyltransferase
(Homo sapiens (Human))
BDBM180272
(US9676721, 42 2-cyano-1-({4-[(3-methoxybenzene)sul...)
Show SMILES COc1cccc(c1)S(=O)(=O)c1ccc(CNC(Nc2ccncc2)=NC#N)cc1 |w:25.27|
Show InChI InChI=1S/C21H19N5O3S/c1-29-18-3-2-4-20(13-18)30(27,28)19-7-5-16(6-8-19)14-24-21(25-15-22)26-17-9-11-23-12-10-17/h2-13H,14H2,1H3,(H2,23,24,25,26)
Reactome pathway
US Patent
n/an/a 1.5n/an/an/an/a7.525
FORMA TM, LLC
US Patent
Assay Description
The NAMPT enzymatic reactions were carried out in Buffer A (50 mM Hepes pH 7.5, 50 mM NaCl, 5 mM MgCl2, and 1 mM THP) in 96-well V-bottom plates. The...
US Patent US9676721 (2017)
BindingDB Entry DOI: 10.7270/Q2VD6WMM