BDBM1803 2-Amino-6-arylthiobenzonitrile deriv. 3w::2-amino-6-[(3-bromo-5-methylbenzene)sulfonyl]benzonitrile
SMILES: Cc1cc(Br)cc(c1)S(=O)(=O)c1cccc(N)c1C#N
InChI Key: InChIKey=MRFNXYCMJVBPGQ-UHFFFAOYSA-N
Data: 4 IC50
Activity Spreadsheet -- Enzyme Inhibition Constant Data from BindingDB
Found 4 hits for monomerid = 1803
Trg + Lig
Ki
nM
ΔG°
kcal/mole
IC50
nM
Kd
nM
EC50/IC50
nM
koff
s-1
kon
M-1s-1
pHTemp
°C
HIV-1 Reverse Transcriptase
(Human immunodeficiency virus type 1)
BDBM1803
(2-Amino-6-arylthiobenzonitrile deriv. 3w | 2-amino...)
Show SMILES Cc1cc(Br)cc(c1)S(=O)(=O)c1cccc(N)c1C#N
Show InChI InChI=1S/C14H11BrN2O2S/c1-9-5-10(15)7-11(6-9)20(18,19)14-4-2-3-13(17)12(14)8-16/h2-7H,17H2,1H3
n/an/a 3n/an/an/an/an/an/a
GlaxoSmithKline
Assay Description
The IC50 of reverse transcriptase is the concentration that inhibits 50% of recombinant HIV-1 RT RNA-directed DNA polymerase activity in vitro.
J Med Chem 44: 1866-82 (2001)
Article DOI: 10.1021/jm0004906
BindingDB Entry DOI: 10.7270/Q2FJ2F09
Reverse transcriptase
(Human immunodeficiency virus 1)
BDBM1803
(2-Amino-6-arylthiobenzonitrile deriv. 3w | 2-amino...)
Show SMILES Cc1cc(Br)cc(c1)S(=O)(=O)c1cccc(N)c1C#N
Show InChI InChI=1S/C14H11BrN2O2S/c1-9-5-10(15)7-11(6-9)20(18,19)14-4-2-3-13(17)12(14)8-16/h2-7H,17H2,1H3
n/an/a 3n/an/an/an/an/an/a
TBA
Assay Description
Inhibition of HIV-1 reverse transcriptase
Citation and Details
Article DOI: 10.1007/s00044-013-0765-3
BindingDB Entry DOI: 10.7270/Q2W66PQQ
Reverse transcriptase
(Human immunodeficiency virus 1)
BDBM1803
(2-Amino-6-arylthiobenzonitrile deriv. 3w | 2-amino...)
Show SMILES Cc1cc(Br)cc(c1)S(=O)(=O)c1cccc(N)c1C#N
Show InChI InChI=1S/C14H11BrN2O2S/c1-9-5-10(15)7-11(6-9)20(18,19)14-4-2-3-13(17)12(14)8-16/h2-7H,17H2,1H3
n/an/a 3.00E+3n/an/an/an/an/an/a
Lanzhou University
Curated by ChEMBL
Assay Description
Inhibition of HIV1 reverse transcriptase
Eur J Med Chem 44: 2158-71 (2009)
Article DOI: 10.1016/j.ejmech.2008.10.021
BindingDB Entry DOI: 10.7270/Q21R6T9R
Human immunodeficiency virus type 1 reverse transcriptase
(Human immunodeficiency virus 1)
BDBM1803
(2-Amino-6-arylthiobenzonitrile deriv. 3w | 2-amino...)
Show SMILES Cc1cc(Br)cc(c1)S(=O)(=O)c1cccc(N)c1C#N
Show InChI InChI=1S/C14H11BrN2O2S/c1-9-5-10(15)7-11(6-9)20(18,19)14-4-2-3-13(17)12(14)8-16/h2-7H,17H2,1H3
n/an/a 3n/an/an/an/an/an/a
University of Perugia
Curated by ChEMBL
Assay Description
Inhibitory concentration against Reverse transcriptase
J Med Chem 48: 3756-67 (2005)
Article DOI: 10.1021/jm049162m
BindingDB Entry DOI: 10.7270/Q2XS5WQ0