BDBM18047 5-[(4-TERT-BUTYLPHENYL)SULFANYL]-2,4-QUINAZOLINEDIAMINE::5-[(4-tert-butylphenyl)sulfanyl]quinazoline-2,4-diamine::GW995
SMILES: CC(C)(C)c1ccc(Sc2cccc3nc(N)nc(N)c23)cc1
InChI Key: InChIKey=MNYDVPDMLAJJPB-UHFFFAOYSA-N
Data: 4 IC50
PDB links: 1 PDB ID matches this monomer.
Activity Spreadsheet -- Enzyme Inhibition Constant Data from BindingDB
Found 4 hits for monomerid = 18047
Trg + Lig
Ki
nM
ΔG°
kcal/mole
IC50
nM
Kd
nM
EC50/IC50
nM
koff
s-1
kon
M-1s-1
pHTemp
°C
Dihydrofolate Reductase (DHFR)
(Candida albicans)
BDBM18047
(5-[(4-TERT-BUTYLPHENYL)SULFANYL]-2,4-QUINAZOLINEDI...)
Show SMILES CC(C)(C)c1ccc(Sc2cccc3nc(N)nc(N)c23)cc1
Show InChI InChI=1S/C18H20N4S/c1-18(2,3)11-7-9-12(10-8-11)23-14-6-4-5-13-15(14)16(19)22-17(20)21-13/h4-10H,1-3H3,(H4,19,20,21,22)
n/an/a 8n/an/an/an/a6.430
GSK
Assay Description
IC50 is the concentration of inhibitor that decreases the velocity of the standard assay by 50%. The enzyme, NADPH, and varying concentrations of inh...
J Med Chem 44: 2928-32 (2001)
Article DOI: 10.1021/jm0101444
BindingDB Entry DOI: 10.7270/Q2XW4H2K
3D
3D Structure (crystal)
Dihydrofolate Reductase (DHFR)
(Candida albicans)
BDBM18047
(5-[(4-TERT-BUTYLPHENYL)SULFANYL]-2,4-QUINAZOLINEDI...)
Show SMILES CC(C)(C)c1ccc(Sc2cccc3nc(N)nc(N)c23)cc1
Show InChI InChI=1S/C18H20N4S/c1-18(2,3)11-7-9-12(10-8-11)23-14-6-4-5-13-15(14)16(19)22-17(20)21-13/h4-10H,1-3H3,(H4,19,20,21,22)
n/an/a 8n/an/an/an/an/an/a
Burroughs Wellcome Company
Curated by ChEMBL
Assay Description
Inhibition of dihydrofolate reductase in Candida albicans (in vitro).
J Med Chem 38: 3608-16 (1995)
BindingDB Entry DOI: 10.7270/Q2V69KS6
3D
3D Structure (crystal)
Dihydrofolate reductase
(Homo sapiens (Human))
BDBM18047
(5-[(4-TERT-BUTYLPHENYL)SULFANYL]-2,4-QUINAZOLINEDI...)
Show SMILES CC(C)(C)c1ccc(Sc2cccc3nc(N)nc(N)c23)cc1
Show InChI InChI=1S/C18H20N4S/c1-18(2,3)11-7-9-12(10-8-11)23-14-6-4-5-13-15(14)16(19)22-17(20)21-13/h4-10H,1-3H3,(H4,19,20,21,22)
NCI pathway
Reactome pathway
n/an/a 2.00E+3n/an/an/an/an/an/a
Burroughs Wellcome Company
Curated by ChEMBL
Assay Description
In vitro inhibition of human dihydrofolate reductase
J Med Chem 38: 3608-16 (1995)
BindingDB Entry DOI: 10.7270/Q2V69KS6
Dihydrofolate reductase
(Homo sapiens (Human))
BDBM18047
(5-[(4-TERT-BUTYLPHENYL)SULFANYL]-2,4-QUINAZOLINEDI...)
Show SMILES CC(C)(C)c1ccc(Sc2cccc3nc(N)nc(N)c23)cc1
Show InChI InChI=1S/C18H20N4S/c1-18(2,3)11-7-9-12(10-8-11)23-14-6-4-5-13-15(14)16(19)22-17(20)21-13/h4-10H,1-3H3,(H4,19,20,21,22)
NCI pathway
Reactome pathway
n/an/a 2.00E+3n/an/an/an/a7.030
GSK
Assay Description
IC50 is the concentration of inhibitor that decreases the velocity of the standard assay by 50%. The enzyme, NADPH, and varying concentrations of inh...
J Med Chem 44: 2928-32 (2001)
Article DOI: 10.1021/jm0101444
BindingDB Entry DOI: 10.7270/Q2XW4H2K