null
SMILES: COc1cc(F)ccc1-c1nc(Nc2cc(CS(C)(=N)=O)cc(c2)S(F)(F)(F)(F)F)ncc1F
InChI Key: InChIKey=KMRJEIFKFAGWAW-UHFFFAOYSA-N
Activity Spreadsheet -- Enzyme Inhibition Constant Data from BindingDB
Found 9 hits for monomerid = 180856
Trg + Lig
Ki
nM
ΔG°
kcal/mole
IC50
nM
Kd
nM
EC50/IC50
nM
koff
s-1
kon
M-1s-1
pHTemp
°C
Cyclin-dependent kinase 9
(Homo sapiens (Human))
BDBM180856
(US9133171, 61 | US9133171, 62 | US9133171, 63)
Show SMILES COc1cc(F)ccc1-c1nc(Nc2cc(CS(C)(=N)=O)cc(c2)S(F)(F)(F)(F)F)ncc1F
Show InChI InChI=1S/C19H17F7N4O2S2/c1-32-17-7-12(20)3-4-15(17)18-16(21)9-28-19(30-18)29-13-5-11(10-33(2,27)31)6-14(8-13)34(22,23,24,25)26/h3-9,27H,10H2,1-2H3,(H,28,29,30)
Reactome pathway
US Patent
n/an/a 6n/an/an/an/a8.022
Bayer Intellectual Property GmbH
US Patent
Assay Description
Recombinant full-length His-tagged human CDK9 and CycT1, expressed in insect cells and purified by Ni-NTA affinity chromatography, were purchased fro...
US Patent US9133171 (2015)
BindingDB Entry DOI: 10.7270/Q2SX6C0W
Cyclin-dependent kinase 9
(Homo sapiens (Human))
BDBM180856
(US9133171, 61 | US9133171, 62 | US9133171, 63)
Show SMILES COc1cc(F)ccc1-c1nc(Nc2cc(CS(C)(=N)=O)cc(c2)S(F)(F)(F)(F)F)ncc1F
Show InChI InChI=1S/C19H17F7N4O2S2/c1-32-17-7-12(20)3-4-15(17)18-16(21)9-28-19(30-18)29-13-5-11(10-33(2,27)31)6-14(8-13)34(22,23,24,25)26/h3-9,27H,10H2,1-2H3,(H,28,29,30)
Reactome pathway
US Patent
n/an/a 5n/an/an/an/a8.022
Bayer Intellectual Property GmbH
US Patent
Assay Description
Recombinant full-length His-tagged human CDK9 and CycT1, expressed in insect cells and purified by Ni-NTA affinity chromatography, were purchased fro...
US Patent US9133171 (2015)
BindingDB Entry DOI: 10.7270/Q2SX6C0W
Cyclin-dependent kinase 9
(Homo sapiens (Human))
BDBM180856
(US9133171, 61 | US9133171, 62 | US9133171, 63)
Show SMILES COc1cc(F)ccc1-c1nc(Nc2cc(CS(C)(=N)=O)cc(c2)S(F)(F)(F)(F)F)ncc1F
Show InChI InChI=1S/C19H17F7N4O2S2/c1-32-17-7-12(20)3-4-15(17)18-16(21)9-28-19(30-18)29-13-5-11(10-33(2,27)31)6-14(8-13)34(22,23,24,25)26/h3-9,27H,10H2,1-2H3,(H,28,29,30)
Reactome pathway
US Patent
n/an/a 3n/an/an/an/a8.022
Bayer Intellectual Property GmbH
US Patent
Assay Description
Recombinant full-length His-tagged human CDK9 and CycT1, expressed in insect cells and purified by Ni-NTA affinity chromatography, were purchased fro...
US Patent US9133171 (2015)
BindingDB Entry DOI: 10.7270/Q2SX6C0W
Cyclin-dependent kinase 2
(Homo sapiens (Human))
BDBM180856
(US9133171, 61 | US9133171, 62 | US9133171, 63)
Show SMILES COc1cc(F)ccc1-c1nc(Nc2cc(CS(C)(=N)=O)cc(c2)S(F)(F)(F)(F)F)ncc1F
Show InChI InChI=1S/C19H17F7N4O2S2/c1-32-17-7-12(20)3-4-15(17)18-16(21)9-28-19(30-18)29-13-5-11(10-33(2,27)31)6-14(8-13)34(22,23,24,25)26/h3-9,27H,10H2,1-2H3,(H,28,29,30)
NCI pathway
Reactome pathway
US Patent
n/an/a 290n/an/an/an/a8.022
Bayer Intellectual Property GmbH
US Patent
Assay Description
Recombinant fusion proteins of GST and human CDK2 and of GST and human CycE, expressed in insect cells (Sf9) and purified by Glutathion-Sepharose aff...
US Patent US9133171 (2015)
BindingDB Entry DOI: 10.7270/Q2SX6C0W
Cyclin-dependent kinase 9
(Homo sapiens (Human))
BDBM180856
(US9133171, 61 | US9133171, 62 | US9133171, 63)
Show SMILES COc1cc(F)ccc1-c1nc(Nc2cc(CS(C)(=N)=O)cc(c2)S(F)(F)(F)(F)F)ncc1F
Show InChI InChI=1S/C19H17F7N4O2S2/c1-32-17-7-12(20)3-4-15(17)18-16(21)9-28-19(30-18)29-13-5-11(10-33(2,27)31)6-14(8-13)34(22,23,24,25)26/h3-9,27H,10H2,1-2H3,(H,28,29,30)
Reactome pathway
US Patent
n/an/a 3n/an/an/an/a8.022
Bayer Intellectual Property GmbH
US Patent
Assay Description
Recombinant full-length His-tagged human CDK9 and CycT1, expressed in insect cells and purified by Ni-NTA affinity chromatography, were purchase from...
US Patent US9133171 (2015)
BindingDB Entry DOI: 10.7270/Q2SX6C0W
Cyclin-dependent kinase 2
(Homo sapiens (Human))
BDBM180856
(US9133171, 61 | US9133171, 62 | US9133171, 63)
Show SMILES COc1cc(F)ccc1-c1nc(Nc2cc(CS(C)(=N)=O)cc(c2)S(F)(F)(F)(F)F)ncc1F
Show InChI InChI=1S/C19H17F7N4O2S2/c1-32-17-7-12(20)3-4-15(17)18-16(21)9-28-19(30-18)29-13-5-11(10-33(2,27)31)6-14(8-13)34(22,23,24,25)26/h3-9,27H,10H2,1-2H3,(H,28,29,30)
NCI pathway
Reactome pathway
US Patent
n/an/a 200n/an/an/an/a8.022
Bayer Intellectual Property GmbH
US Patent
Assay Description
Recombinant fusion proteins of GST and human CDK2 and of GST and human CycE, expressed in insect cells (Sf9) and purified by Glutathion-Sepharose aff...
US Patent US9133171 (2015)
BindingDB Entry DOI: 10.7270/Q2SX6C0W
Cyclin-dependent kinase 9
(Homo sapiens (Human))
BDBM180856
(US9133171, 61 | US9133171, 62 | US9133171, 63)
Show SMILES COc1cc(F)ccc1-c1nc(Nc2cc(CS(C)(=N)=O)cc(c2)S(F)(F)(F)(F)F)ncc1F
Show InChI InChI=1S/C19H17F7N4O2S2/c1-32-17-7-12(20)3-4-15(17)18-16(21)9-28-19(30-18)29-13-5-11(10-33(2,27)31)6-14(8-13)34(22,23,24,25)26/h3-9,27H,10H2,1-2H3,(H,28,29,30)
Reactome pathway
US Patent
n/an/a 6n/an/an/an/a8.022
Bayer Intellectual Property GmbH
US Patent
Assay Description
Recombinant full-length His-tagged human CDK9 and CycT1, expressed in insect cells and purified by Ni-NTA affinity chromatography, were purchase from...
US Patent US9133171 (2015)
BindingDB Entry DOI: 10.7270/Q2SX6C0W
Cyclin-dependent kinase 9
(Homo sapiens (Human))
BDBM180856
(US9133171, 61 | US9133171, 62 | US9133171, 63)
Show SMILES COc1cc(F)ccc1-c1nc(Nc2cc(CS(C)(=N)=O)cc(c2)S(F)(F)(F)(F)F)ncc1F
Show InChI InChI=1S/C19H17F7N4O2S2/c1-32-17-7-12(20)3-4-15(17)18-16(21)9-28-19(30-18)29-13-5-11(10-33(2,27)31)6-14(8-13)34(22,23,24,25)26/h3-9,27H,10H2,1-2H3,(H,28,29,30)
Reactome pathway
US Patent
n/an/a 5n/an/an/an/a8.022
Bayer Intellectual Property GmbH
US Patent
Assay Description
Recombinant full-length His-tagged human CDK9 and CycT1, expressed in insect cells and purified by Ni-NTA affinity chromatography, were purchase from...
US Patent US9133171 (2015)
BindingDB Entry DOI: 10.7270/Q2SX6C0W
Cyclin-dependent kinase 2
(Homo sapiens (Human))
BDBM180856
(US9133171, 61 | US9133171, 62 | US9133171, 63)
Show SMILES COc1cc(F)ccc1-c1nc(Nc2cc(CS(C)(=N)=O)cc(c2)S(F)(F)(F)(F)F)ncc1F
Show InChI InChI=1S/C19H17F7N4O2S2/c1-32-17-7-12(20)3-4-15(17)18-16(21)9-28-19(30-18)29-13-5-11(10-33(2,27)31)6-14(8-13)34(22,23,24,25)26/h3-9,27H,10H2,1-2H3,(H,28,29,30)
NCI pathway
Reactome pathway
US Patent
n/an/a 170n/an/an/an/a8.022
Bayer Intellectual Property GmbH
US Patent
Assay Description
Recombinant fusion proteins of GST and human CDK2 and of GST and human CycE, expressed in insect cells (Sf9) and purified by Glutathion-Sepharose aff...
US Patent US9133171 (2015)
BindingDB Entry DOI: 10.7270/Q2SX6C0W