BDBM181073 (E)-N'-(3-bromobenzylidene)-4-(2-oxo-2H-chromen-3-yl)thiazole-2-carbohydrazide (7r)
SMILES: Brc1cccc(\C=N\NC(=O)c2nc(cs2)-c2cc3ccccc3oc2=O)c1
InChI Key: InChIKey=LBNFOQAQBGEAFZ-LSHDLFTRSA-N
Data: 2 IC50
Activity Spreadsheet -- Enzyme Inhibition Constant Data from BindingDB
Found 2 hits for monomerid = 181073
Trg + Lig
Ki
nM
ΔG°
kcal/mole
IC50
nM
Kd
nM
EC50/IC50
nM
koff
s-1
kon
M-1s-1
pHTemp
°C
Probable maltase-glucoamylase 2
(Homo sapiens)
BDBM181073
((E)-N'-(3-bromobenzylidene)-4-(2-oxo-2H-chrome...)
Show SMILES Brc1cccc(\C=N\NC(=O)c2nc(cs2)-c2cc3ccccc3oc2=O)c1
Show InChI InChI=1S/C20H12BrN3O3S/c21-14-6-3-4-12(8-14)10-22-24-18(25)19-23-16(11-28-19)15-9-13-5-1-2-7-17(13)27-20(15)26/h1-11H,(H,24,25)/b22-10+
n/an/a 6.20E+3n/an/an/an/an/an/a
Babasaheb Bhimrao Ambedkar University (A Central University)
Curated by ChEMBL
Assay Description
Inhibition of alpha-glucosidase (unknown origin) using p-nitro phenyl glucopyranoside as substrate preincubated for 10 mins followed by substrate add...
Eur J Med Chem 176: 343-377 (2019)
Article DOI: 10.1016/j.ejmech.2019.04.025
Alpha-glucosidase MAL12
(Saccharomyces cerevisiae)
BDBM181073
((E)-N'-(3-bromobenzylidene)-4-(2-oxo-2H-chrome...)
Show SMILES Brc1cccc(\C=N\NC(=O)c2nc(cs2)-c2cc3ccccc3oc2=O)c1
Show InChI InChI=1S/C20H12BrN3O3S/c21-14-6-3-4-12(8-14)10-22-24-18(25)19-23-16(11-28-19)15-9-13-5-1-2-7-17(13)27-20(15)26/h1-11H,(H,24,25)/b22-10+
Reactome pathway
n/an/a 1.40E+4n/an/an/an/a6.8n/a
Jishou University
Assay Description
The test compounds were dissolved in DMSO to prepare the required distributing concentration. α-Glucosidase inhibitory activity was assayed by u...
Bioorg Chem 65: 167-74 (2016)
Article DOI: 10.1016/j.bioorg.2016.03.001
BindingDB Entry DOI: 10.7270/Q2445K8R