BDBM18123 (5S)-5-{[({[(2R,3S,4R,5R)-5-(6-amino-9H-purin-9-yl)-3,4-dihydroxyoxolan-2-yl]methoxy}sulfonyl)amino]carbonyl}pyrrolidin-2-one::5-O-[N-(L-pyroglutamyl)-sulfamoyl]adenosine::pGluAMS
SMILES: Nc1ncnc2n(cnc12)[C@@H]1O[C@H](COS(=O)(=O)NC(=O)[C@@H]2CCC(=O)N2)[C@@H](O)[C@H]1O
InChI Key: InChIKey=SBKAGUBHHUQAFA-WERHYGNASA-N
Data: 1 KI
Activity Spreadsheet -- Enzyme Inhibition Constant Data from BindingDB
Found 1 hit for monomerid = 18123
Trg + Lig
Ki
nM
ΔG°
kcal/mole
IC50
nM
Kd
nM
EC50/IC50
nM
koff
s-1
kon
M-1s-1
pHTemp
°C
tRNA synthetase (GluRS)
(Escherichia coli)
BDBM18123
((5S)-5-{[({[(2R,3S,4R,5R)-5-(6-amino-9H-purin-9-yl...)
Show SMILES Nc1ncnc2n(cnc12)[C@@H]1O[C@H](COS(=O)(=O)NC(=O)[C@@H]2CCC(=O)N2)[C@@H](O)[C@H]1O |r|
Show InChI InChI=1S/C15H19N7O8S/c16-12-9-13(18-4-17-12)22(5-19-9)15-11(25)10(24)7(30-15)3-29-31(27,28)21-14(26)6-1-2-8(23)20-6/h4-7,10-11,15,24-25H,1-3H2,(H,20,23)(H,21,26)(H2,16,17,18)/t6-,7+,10+,11+,15+/m0/s1
1.50E+4 -6.84n/an/an/an/an/a7.237
CREFSIP
Assay Description
The Km and Kappm for the amino acid substrate were first calculated from Lineweaver-Burk plots. The Ki values were calculated from the Kappm vs [I] p...
J Enzyme Inhib Med Chem 20: 61-7 (2005)
Article DOI: 10.1080/14756360400002007
BindingDB Entry DOI: 10.7270/Q2X0659C