BDBM181432 US9139577, 2.041::US9708274, 2.041
SMILES: C[C@@H](Oc1cc(F)ccc1Nc1ncnc2cc(cc(C)c12)N=S1(=O)CCC1)C(=O)NC(C(F)(F)F)C(F)(F)F
InChI Key: InChIKey=JVNFBEPYSAUPEH-CYBMUJFWSA-N
Data: 2 IC50
Activity Spreadsheet -- Enzyme Inhibition Constant Data from BindingDB
Found 2 hits for monomerid = 181432
Trg + Lig
Ki
nM
ΔG°
kcal/mole
IC50
nM
Kd
nM
EC50/IC50
nM
koff
s-1
kon
M-1s-1
pHTemp
°C
MAP kinase-interacting serine/threonine-protein kinase 2
(Homo sapiens (Human))
BDBM181432
(US9139577, 2.041 | US9708274, 2.041)
Show SMILES C[C@@H](Oc1cc(F)ccc1Nc1ncnc2cc(cc(C)c12)N=S1(=O)CCC1)C(=O)NC(C(F)(F)F)C(F)(F)F |r|
Show InChI InChI=1S/C24H22F7N5O3S/c1-12-8-15(36-40(38)6-3-7-40)10-17-19(12)20(33-11-32-17)34-16-5-4-14(25)9-18(16)39-13(2)21(37)35-22(23(26,27)28)24(29,30)31/h4-5,8-11,13,22H,3,6-7H2,1-2H3,(H,35,37)(H,32,33,34)/t13-/m1/s1
US Patent
n/an/a 1n/an/an/an/an/a25
EVOTEC INTERNATIONAL GMBH
US Patent
Assay Description
The inhibition of kinase activity of MNK2a was assessed using pre-activated GST-MNK2a. The white, 384-well OptiPlate F plates were purchased from Per...
US Patent US9708274 (2017)
BindingDB Entry DOI: 10.7270/Q2VX0JJG
MAP kinase-interacting serine/threonine-protein kinase 2
(Homo sapiens (Human))
BDBM181432
(US9139577, 2.041 | US9708274, 2.041)
Show SMILES C[C@@H](Oc1cc(F)ccc1Nc1ncnc2cc(cc(C)c12)N=S1(=O)CCC1)C(=O)NC(C(F)(F)F)C(F)(F)F |r|
Show InChI InChI=1S/C24H22F7N5O3S/c1-12-8-15(36-40(38)6-3-7-40)10-17-19(12)20(33-11-32-17)34-16-5-4-14(25)9-18(16)39-13(2)21(37)35-22(23(26,27)28)24(29,30)31/h4-5,8-11,13,22H,3,6-7H2,1-2H3,(H,35,37)(H,32,33,34)/t13-/m1/s1
US Patent
n/an/a 1n/an/an/an/an/an/a
Boehringer Ingelheim International GmbH
US Patent
Assay Description
The inhibition of kinase activity of MNK2a was assessed using pre-activated GST-MNK2a. The white, 384-well OptiPlate F plates were purchased from Per...
US Patent US9139577 (2015)
BindingDB Entry DOI: 10.7270/Q2K64GT1