BDBM181445 US9139577, 3.006::US9708274, 3.006
SMILES: Cc1cc(cc2ncnc(Nc3ccc(F)cc3OCC3CCCCO3)c12)N=S(C)(C)=O
InChI Key: InChIKey=BAODKAHGNBBBAB-UHFFFAOYSA-N
Data: 2 IC50
Activity Spreadsheet -- Enzyme Inhibition Constant Data from BindingDB
Found 2 hits for monomerid = 181445
Trg + Lig
Ki
nM
ΔG°
kcal/mole
IC50
nM
Kd
nM
EC50/IC50
nM
koff
s-1
kon
M-1s-1
pHTemp
°C
MAP kinase-interacting serine/threonine-protein kinase 2
(Homo sapiens (Human))
BDBM181445
(US9139577, 3.006 | US9708274, 3.006)
Show SMILES Cc1cc(cc2ncnc(Nc3ccc(F)cc3OCC3CCCCO3)c12)N=S(C)(C)=O
Show InChI InChI=1S/C23H27FN4O3S/c1-15-10-17(28-32(2,3)29)12-20-22(15)23(26-14-25-20)27-19-8-7-16(24)11-21(19)31-13-18-6-4-5-9-30-18/h7-8,10-12,14,18H,4-6,9,13H2,1-3H3,(H,25,26,27)
US Patent
n/an/a 1n/an/an/an/an/a25
EVOTEC INTERNATIONAL GMBH
US Patent
Assay Description
The inhibition of kinase activity of MNK2a was assessed using pre-activated GST-MNK2a. The white, 384-well OptiPlate F plates were purchased from Per...
US Patent US9708274 (2017)
BindingDB Entry DOI: 10.7270/Q2VX0JJG
MAP kinase-interacting serine/threonine-protein kinase 2
(Homo sapiens (Human))
BDBM181445
(US9139577, 3.006 | US9708274, 3.006)
Show SMILES Cc1cc(cc2ncnc(Nc3ccc(F)cc3OCC3CCCCO3)c12)N=S(C)(C)=O
Show InChI InChI=1S/C23H27FN4O3S/c1-15-10-17(28-32(2,3)29)12-20-22(15)23(26-14-25-20)27-19-8-7-16(24)11-21(19)31-13-18-6-4-5-9-30-18/h7-8,10-12,14,18H,4-6,9,13H2,1-3H3,(H,25,26,27)
US Patent
n/an/a 1n/an/an/an/an/an/a
Boehringer Ingelheim International GmbH
US Patent
Assay Description
The inhibition of kinase activity of MNK2a was assessed using pre-activated GST-MNK2a. The white, 384-well OptiPlate F plates were purchased from Per...
US Patent US9139577 (2015)
BindingDB Entry DOI: 10.7270/Q2K64GT1