null
SMILES: Oc1c2[C@H]3CC[C@H](C3)n2c(=O)n1-c1ccc(C#N)c2ccccc12
InChI Key: InChIKey=ZBVCEGCGGLIGHI-WCQYABFASA-N
Activity Spreadsheet -- Enzyme Inhibition Constant Data from BindingDB
Found 1 hit for monomerid = 18163
Trg + Lig
Ki
nM
ΔG°
kcal/mole
IC50
nM
Kd
nM
EC50/IC50
nM
koff
s-1
kon
M-1s-1
pHTemp
°C
Androgen receptor
(Homo sapiens (Human))
BDBM18163
(4-[(1R,6R,7S)-3,5-dioxo-2,4-diazatricyclo[5.2.1.0^...)
Show SMILES Oc1c2[C@H]3CC[C@H](C3)n2c(=O)n1-c1ccc(C#N)c2ccccc12 |r,wU:6.6,3.7,(12.2,-7.28,;12.6,-8.77,;11.56,-9.96,;10.02,-9.96,;9.25,-11.29,;10.02,-12.62,;11.56,-12.62,;10.02,-11.73,;12.33,-11.29,;13.87,-10.92,;15.03,-11.93,;14,-9.4,;15.49,-9,;16.07,-7.57,;17.59,-7.36,;18.54,-8.57,;20.06,-8.36,;21.55,-7.96,;17.96,-10,;18.91,-11.21,;18.34,-12.64,;16.81,-12.86,;15.86,-11.64,;16.44,-10.22,)|
Show InChI InChI=1S/C19H15N3O2/c20-10-12-6-8-16(15-4-2-1-3-14(12)15)22-18(23)17-11-5-7-13(9-11)21(17)19(22)24/h1-4,6,8,11,13,23H,5,7,9H2/t11-,13+/m0/s1
NCI pathway
Reactome pathway
24 -10.3 260n/a>1.00E+3n/an/a7.422
Bristol-Myers Squibb Company
Assay Description
Receptor Binding Assay (Ki)-Binding determined through direct displacement of ligand with [3H]-DHT in the MDA-453 cell line. Transactivation Assay (E...
J Med Chem 49: 7596-9 (2006)
Article DOI: 10.1021/jm061101w
BindingDB Entry DOI: 10.7270/Q2862DQ9